Chromium Code Reviews
chromiumcodereview-hr@appspot.gserviceaccount.com (chromiumcodereview-hr) | Please choose your nickname with Settings | Help | Chromium Project | Gerrit Changes | Sign out
(148)

Issue 1958093002: CONTINUED Make FrameSelection to hold non-canonicalized positions

Created:
4 years, 7 months ago by yosin_UTC9
Modified:
3 years, 11 months ago
Reviewers:
CC:
blink-reviews, blink-reviews-dom_chromium.org, blink-reviews-html_chromium.org, chromium-reviews, dglazkov+blink, eae+blinkwatch, rwlbuis, sof
Base URL:
https://chromium.googlesource.com/chromium/src.git@master
Target Ref:
refs/pending/heads/master
Project:
chromium
Visibility:
Public.

Description

This patch continues to http://crrev.com/2637013002 Since, this page is too big. BUG=139552, 603684, 605499, 606499, 625533, 644648, 679991 On-demand visible selection canonicalizataion After this patch, we will do following: - Rename FrameSelection::selection() to computeVisibleSelectionDerprecated() - Hoist updateStyleAndLayoutIngoringStyleSheet() from computeVisibleSelectionDerprecated() - Interoperabl Selection API; no canonicalization - Multiple range selection - Move VisiblePosition and VisibleSelection to editing/core/commands TDOO(yosin) Incorporate below changes into FrameCaret.cpp - http://ccrrev.com/2565103002: Fix mismatched nullptr check for caret paint invalidation. - http://crrev.com/2599613002: [SPInvalidation] Fix caret paint invalidation in sub frames == Failed test 2017-01-05T17:39:23 * ApplyStyleCommandTest.RemoveRedundantBlocksWithStarEditableStyle * DocumentTest.SynchronousMutationNotifierMergeTextNodes * editing/execCommand/indent-paragraphs.html * editing/input/caret-read-only-after-editable.html * fast/dom/shadow/selection-in-nested-shadow.html * virtual/spinvalidation/paint/invalidation/4776765.html * editing/selection/drag-in-iframe.html * editing/caret/caret-hidden-when-unfocused.html * virtual/spinvalidation/paint/invalidation/caret-contenteditable-content-after.html * virtual/spinvalidation/paint/invalidation/caret-color.html * virtual/spinvalidation/paint/invalidation/selection-after-delete.html == Failed test 2016-11-17T17:06 css3/filters/effect-reference-ordering.html editing/input/caret-read-only-after-editable.html fast/dom/shadow/selection-in-nested-shadow.html * fast/events/drag_and_drop_into_removed_on_focus.html * fast/replaced/selection-rect-transform.html * fast/replaced/selection-rect.html images/element-gcd-while-generating-alt-content.html paint/invalidation/4776765.html paint/invalidation/selection-after-delete.html paint/selection/selection-drag-image-in-iframe.html svg/foreignObject/viewport-foreignobject-crash.html transforms/3d/point-mapping/3d-point-mapping-deep.html virtual/gpu-rasterization/images/element-gcd-while-generating-alt-content.html CQ_INCLUDE_TRYBOTS=master.tryserver.chromium.linux:linux_layout_tests_slimming_paint_v2

Patch Set 1 #

Patch Set 2 : 2016-05-11T18:48:34 #

Patch Set 3 : 2016-05-12T10:54:27 #

Patch Set 4 : 2016-05-12T15:06:19 #

Patch Set 5 : 2016-05-13T10:06:08 #

Patch Set 6 : 2016-05-13T20:04:10 #

Patch Set 7 : 2016-05-16T10:46:48 #

Patch Set 8 : 2016-05-16T13:53:02 #

Patch Set 9 : 2016-05-16T15:17:18 #

Patch Set 10 : 2016-05-16T18:07:30 #

Patch Set 11 : 2016-05-18T18:22:18 #

Patch Set 12 : 2016-05-23T16:07:48 #

Patch Set 13 : 2016-05-23T18:07:09 #

Patch Set 14 : 2016-05-30T18:47:23 #

Patch Set 15 : 2016-05-31T14:36:26 #

Patch Set 16 : 2016-05-31T15:14:49 #

Patch Set 17 : 2016-06-10T19:25:33 #

Patch Set 18 : 2016-06-23T16:03:40 #

Patch Set 19 : 2016-06-23T17:39:57 #

Patch Set 20 : 2016-07-28T18:39:43 #

Patch Set 21 : 2016-08-01T18:42:07 #

Patch Set 22 : 2016-08-03T17:53:23 #

Patch Set 23 : 2016-08-03T18:24:52 #

Patch Set 24 : 2016-08-04T11:01:14 #

Patch Set 25 : 2016-08-04T17:36:23 #

Patch Set 26 : 2016-08-08T19:30:00 #

Patch Set 27 : 2016-08-09T18:51:38 #

Patch Set 28 : 2016-08-10T10:43:33 #

Patch Set 29 : 2016-08-10T11:15:11 #

Patch Set 30 : 2016-08-10T19:23:22 #

Patch Set 31 : 2016-08-15T16:39:32 #

Patch Set 32 : 2016-08-16T11:06:57 #

Patch Set 33 : 2016-08-16T12:37:34 #

Patch Set 34 : 2016-08-16T13:06:48 #

Patch Set 35 : 2016-08-16T17:26:23 #

Patch Set 36 : 2016-08-18T16:08:49 #

Patch Set 37 : 2016-08-23T17:16:57 #

Patch Set 38 : 2016-08-24T14:47:12 #

Patch Set 39 : 2016-08-24T15:13:20 #

Patch Set 40 : 2016-08-25T11:30:28 #

Patch Set 41 : 2016-08-25T15:02:30 #

Patch Set 42 : 2016-08-29T16:49:35 #

Patch Set 43 : 2016-08-31T13:11:55 #

Patch Set 44 : 2016-08-31T17:41:44 #

Patch Set 45 : 2016-09-02T15:38:41 #

Patch Set 46 : 2016-09-02T16:00:16 #

Patch Set 47 : 2016-09-05T13:41:05 #

Patch Set 48 : 2016-09-06T18:43:08 #

Patch Set 49 : 2016-09-06T18:51:56 #

Patch Set 50 : 2016-09-07T11:15:58 #

Patch Set 51 : 2016-09-07T15:08:00 #

Patch Set 52 : 2016-09-07T18:54:26 #

Patch Set 53 : 2016-09-08T15:06:39 #

Patch Set 54 : 2016-09-08T19:43:12 #

Patch Set 55 : 2016-09-09T15:52:52 #

Patch Set 56 : 2016-09-09T16:33:29 #

Patch Set 57 : 2016-09-09T17:38:41 #

Patch Set 58 : 2016-09-09T18:27:23 #

Patch Set 59 : 2016-09-12T18:18:52 #

Patch Set 60 : 2016-09-13T15:51:51 #

Patch Set 61 : 2016-09-15T14:06:09 #

Patch Set 62 : 2016-09-16T15:59:05 #

Patch Set 63 : 2016-09-26T14:48:41 #

Patch Set 64 : 2016-09-26T17:57:35 #

Patch Set 65 : 2016-09-26T18:58:13 #

Patch Set 66 : 2016-09-27T18:02:44 #

Patch Set 67 : 2016-09-27T19:10:07 #

Patch Set 68 : 2016-09-28T19:36:59 #

Patch Set 69 : 2016-09-29T19:55:36 #

Patch Set 70 : 2016-10-03T16:47:07 #

Patch Set 71 : 2016-10-03T19:00:30 #

Patch Set 72 : 2016-10-05T18:28:31 #

Patch Set 73 : 2016-10-06T14:27:13 #

Patch Set 74 : 2016-10-07T17:26:30 #

Patch Set 75 : 2016-10-07T18:46:53 #

Patch Set 76 : 2016-10-07T19:06:22 #

Patch Set 77 : 2016-10-12T18:00:36 #

Patch Set 78 : 2016-10-12T18:54:01 #

Patch Set 79 : 2016-10-13T14:42:11 #

Patch Set 80 : 2016-10-25T19:05:41 #

Patch Set 81 : 2016-10-26T13:47:59 #

Patch Set 82 : 2016-10-28T15:49:42 #

Patch Set 83 : 2016-10-28T19:22:37 #

Patch Set 84 : 2016-10-31T14:23:51 #

Patch Set 85 : 2016-10-31T17:40:58 #

Patch Set 86 : 2016-10-31T19:40:00 #

Patch Set 87 : 2016-10-31T19:44:39 #

Patch Set 88 : 2016-10-31T19:47:17 #

Patch Set 89 : 2016-11-01T14:38:29 #

Patch Set 90 : 2016-11-01T19:13:53 #

Patch Set 91 : 2016-11-02T16:49:19 #

Patch Set 92 : 2016-11-02T18:24:12 #

Patch Set 93 : 2016-11-02T18:32:11 #

Patch Set 94 : 2016-11-07T17:54:47 #

Patch Set 95 : 2016-11-07T18:57:08 #

Patch Set 96 : 2016-11-08T18:46:36 #

Patch Set 97 : 2016-11-09T12:10:12 #

Patch Set 98 : 2016-11-10T15:58:46 #

Patch Set 99 : 2016-11-10T16:27:52 #

Patch Set 100 : 2016-11-10T18:25:35 #

Patch Set 101 : 2016-11-10T18:50:59 #

Patch Set 102 : 2016-11-11T16:39:43 #

Patch Set 103 : 2016-11-14T11:11:34 #

Patch Set 104 : 2016-11-14T19:08:20 #

Patch Set 105 : 2016-11-15T19:19:08 #

Patch Set 106 : 2016-11-16T19:06:24 #

Patch Set 107 : 2016-11-17T12:35:26 #

Patch Set 108 : 2016-11-21T13:18:05 #

Patch Set 109 : 2016-11-24T13:45:40 #

Patch Set 110 : 2016-11-24T14:38:59 #

Patch Set 111 : 2016-12-01T16:22:41 #

Patch Set 112 : 2016-12-02T14:52:23 #

Patch Set 113 : 2017-01-05T16:13:22 #

Patch Set 114 : 2017-01-06T15:03:11 #

Patch Set 115 : 2017-01-16T17:45:43 #

Patch Set 116 : 2017-01-16T20:04:35 #

Unified diffs Side-by-side diffs Delta from patch set Stats (+1008 lines, -805 lines) Patch
M third_party/WebKit/LayoutTests/TestExpectations View 1 2 3 4 5 6 7 8 9 10 11 12 13 14 15 16 17 18 19 20 21 22 23 24 25 26 27 28 29 30 31 32 33 34 35 36 37 38 39 40 41 42 43 44 45 46 47 48 49 50 51 52 53 54 55 56 57 58 59 60 61 62 63 64 65 66 67 68 69 70 71 72 73 74 75 76 77 78 79 80 81 82 83 84 85 86 87 88 89 90 91 92 93 94 95 96 97 98 99 100 101 102 103 104 105 106 107 108 109 110 111 112 113 114 115 1 chunk +4 lines, -0 lines 0 comments Download
M third_party/WebKit/LayoutTests/editing/execCommand/crash-indenting-list-item.html View 1 2 3 4 5 6 7 8 9 10 11 12 13 14 15 16 17 18 19 20 21 22 23 24 25 26 27 28 29 30 31 32 33 34 35 36 37 38 39 40 41 42 43 44 45 46 47 48 49 50 1 chunk +1 line, -1 line 0 comments Download
M third_party/WebKit/LayoutTests/editing/execCommand/crash-inserting-list.html View 1 2 3 4 5 6 7 8 9 10 11 12 13 14 15 16 17 18 19 20 21 22 23 24 25 26 27 28 29 30 31 32 33 34 35 36 37 38 39 40 41 42 43 44 45 46 47 48 49 50 51 52 53 54 55 56 57 58 59 60 61 62 63 64 65 66 67 68 69 70 71 72 73 74 75 76 77 78 79 80 81 82 83 84 85 86 87 88 1 chunk +3 lines, -4 lines 0 comments Download
M third_party/WebKit/LayoutTests/editing/execCommand/format-block-multiple-paragraphs-in-pre.html View 1 2 3 4 5 6 7 8 9 10 11 12 13 14 15 16 17 18 19 20 21 22 23 24 25 26 27 28 29 30 31 32 33 34 35 36 37 38 39 40 41 42 43 44 45 46 47 48 49 50 2 chunks +3 lines, -3 lines 0 comments Download
M third_party/WebKit/LayoutTests/editing/execCommand/remove_format_and_extract_contents.html View 1 2 3 4 5 6 7 8 9 10 11 12 13 14 15 16 17 18 19 20 21 22 23 24 25 26 27 28 29 30 31 32 33 34 35 36 37 38 39 40 41 42 43 44 45 46 47 48 49 50 1 chunk +1 line, -1 line 0 comments Download
M third_party/WebKit/LayoutTests/editing/selection/character-data-mutation.html View 1 2 3 4 5 6 7 8 9 10 11 12 13 14 15 16 17 18 19 20 21 22 23 24 25 26 27 28 29 30 31 32 33 34 35 36 37 38 39 40 41 42 43 44 45 46 47 48 49 50 51 52 53 54 55 56 57 58 59 60 61 62 63 64 65 66 67 68 69 70 4 chunks +4 lines, -4 lines 0 comments Download
M third_party/WebKit/LayoutTests/editing/selection/document-mutation.html View 1 2 3 4 5 6 7 8 9 10 11 12 13 14 15 16 17 18 19 20 21 22 23 24 25 26 27 28 29 30 31 32 33 34 35 36 37 38 39 40 41 42 43 44 45 46 47 48 49 50 51 52 53 54 55 56 57 58 59 60 61 62 63 64 65 66 67 1 chunk +1 line, -1 line 0 comments Download
M third_party/WebKit/LayoutTests/editing/selection/select_all/select_all_details_crash.html View 1 2 3 4 5 6 7 8 9 10 11 12 13 14 15 16 17 18 19 20 21 22 23 24 25 26 27 28 29 30 31 32 33 34 35 36 37 38 39 40 41 42 43 44 45 46 47 48 49 50 1 chunk +2 lines, -2 lines 0 comments Download
M third_party/WebKit/LayoutTests/editing/selection/select_all/select_all_iframe_crash.html View 1 2 3 4 5 6 7 8 9 10 11 12 13 14 15 16 17 18 19 20 21 22 23 24 25 26 27 28 29 30 31 32 33 34 35 36 37 38 39 40 41 42 43 44 45 46 47 48 49 50 1 chunk +2 lines, -2 lines 0 comments Download
M third_party/WebKit/LayoutTests/editing/selection/selection_remove_children.html View 1 2 3 4 5 6 7 8 9 10 11 12 13 14 15 16 17 18 19 20 21 22 23 24 25 26 27 28 29 30 31 32 33 34 35 36 37 38 39 40 41 42 43 44 45 46 47 48 49 50 51 52 2 chunks +2 lines, -2 lines 0 comments Download
M third_party/WebKit/LayoutTests/editing/style/justify-left-crash.html View 1 2 3 4 5 6 7 8 9 10 11 12 13 14 15 16 17 18 19 20 21 22 23 24 25 26 27 28 29 30 31 32 33 34 35 36 37 38 39 40 41 42 43 44 45 46 47 48 49 50 1 chunk +5 lines, -3 lines 0 comments Download
M third_party/WebKit/LayoutTests/editing/undo/redo-selection-modify-crash.html View 1 2 3 4 5 6 7 8 9 10 11 12 13 14 15 16 17 18 19 20 21 22 23 24 25 26 27 28 29 30 31 32 33 34 35 36 37 38 39 40 41 42 43 44 45 46 47 48 49 50 1 chunk +1 line, -3 lines 0 comments Download
M third_party/WebKit/LayoutTests/fast/dom/delete-contents.html View 1 2 3 4 5 6 7 8 9 10 11 12 13 14 15 16 17 18 19 20 21 22 23 24 25 26 27 28 29 30 31 32 33 34 35 36 37 38 39 40 41 42 43 44 45 46 47 48 49 50 1 chunk +1 line, -1 line 0 comments Download
M third_party/WebKit/LayoutTests/fast/dynamic/move-node-with-selection.html View 1 2 3 4 5 6 7 8 9 10 11 12 13 14 15 16 17 18 19 20 21 22 23 24 25 26 27 28 29 30 31 32 33 34 35 36 37 38 39 40 41 42 43 44 45 46 47 48 49 50 1 chunk +2 lines, -2 lines 0 comments Download
M third_party/WebKit/LayoutTests/fast/events/drag_and_drop_into_removed_on_focus.html View 1 2 3 4 5 6 7 8 9 10 11 12 13 14 15 16 17 18 19 20 21 22 23 24 25 26 27 28 29 30 31 32 33 34 35 36 37 38 39 40 41 42 43 44 45 46 47 48 49 50 51 52 53 54 55 56 57 58 59 60 61 62 63 64 65 66 67 68 69 70 71 72 73 74 75 76 77 78 79 80 81 82 83 84 85 86 87 88 89 90 91 92 93 94 95 96 97 98 99 100 101 102 103 104 105 106 107 1 chunk +1 line, -1 line 0 comments Download
M third_party/WebKit/LayoutTests/images/element-gcd-while-generating-alt-content-expected.txt View 1 2 3 4 5 6 7 8 9 10 11 12 13 14 15 16 17 18 19 20 21 22 23 24 25 26 27 28 29 30 31 32 33 34 35 36 37 38 39 40 41 42 43 44 45 46 47 48 49 50 51 52 53 54 55 56 57 58 59 60 61 62 63 64 65 66 67 68 69 70 71 72 73 74 75 76 77 78 79 80 81 82 83 84 85 86 87 88 89 90 91 92 93 94 95 96 97 98 99 100 101 102 103 104 105 106 107 1 chunk +0 lines, -9 lines 0 comments Download
M third_party/WebKit/LayoutTests/svg/foreignObject/viewport-foreignobject-crash-expected.html View 1 2 3 4 5 6 7 8 9 10 11 12 13 14 15 16 17 18 19 20 21 22 23 24 25 26 27 28 29 30 31 32 33 34 35 36 37 38 39 40 41 42 43 44 45 46 47 48 49 50 51 52 53 54 55 56 57 58 59 60 61 62 63 64 65 66 67 68 69 70 71 72 73 74 75 76 77 78 79 80 81 82 83 84 85 86 87 88 89 90 91 92 93 94 95 96 97 98 99 100 101 102 103 104 105 106 107 1 chunk +1 line, -1 line 0 comments Download
M third_party/WebKit/Source/core/dom/CharacterData.cpp View 1 2 3 4 5 6 7 8 9 10 11 12 13 14 15 16 17 18 19 20 21 22 23 24 25 26 27 28 29 30 31 32 33 34 35 36 37 38 39 40 41 42 43 44 45 46 47 48 49 50 51 52 53 54 55 56 57 58 59 60 61 62 63 64 65 66 67 68 69 70 71 72 73 74 75 76 77 78 79 80 81 82 83 84 85 86 87 88 89 90 91 92 93 94 95 96 97 98 99 100 101 102 103 104 105 106 107 108 109 2 chunks +5 lines, -13 lines 0 comments Download
M third_party/WebKit/Source/core/dom/Document.h View 1 2 3 4 5 6 7 8 9 10 11 12 13 14 15 16 17 18 19 20 21 22 23 24 25 26 27 28 29 30 31 32 33 34 35 36 37 38 39 40 41 42 43 44 45 46 47 48 49 50 51 52 53 54 55 56 57 58 59 60 61 62 63 64 65 66 67 68 69 70 71 72 73 74 75 76 77 78 79 80 81 82 83 84 85 86 87 88 89 90 91 92 93 94 95 96 97 98 99 100 101 102 103 104 105 106 107 108 109 110 111 112 113 114 115 2 chunks +3 lines, -4 lines 0 comments Download
M third_party/WebKit/Source/core/dom/Document.cpp View 1 2 3 4 5 6 7 8 9 10 11 12 13 14 15 16 17 18 19 20 21 22 23 24 25 26 27 28 29 30 31 32 33 34 35 36 37 38 39 40 41 42 43 44 45 46 47 48 49 50 51 52 53 54 55 56 57 58 59 60 61 62 63 64 65 66 67 68 69 70 71 72 73 74 75 76 77 78 79 80 81 82 83 84 85 86 87 88 89 90 91 92 93 94 95 96 97 98 99 100 101 102 103 104 105 106 107 108 109 110 111 112 113 114 115 6 chunks +6 lines, -20 lines 0 comments Download
M third_party/WebKit/Source/core/dom/DocumentTest.cpp View 1 2 3 4 5 6 7 8 9 10 11 12 13 14 15 16 17 18 19 20 21 22 23 24 25 26 27 28 29 30 31 32 33 34 35 36 37 38 39 40 41 42 43 44 45 46 47 48 49 50 51 52 53 54 55 56 57 58 59 60 61 62 63 64 65 66 67 68 69 70 71 72 73 74 75 76 77 78 79 80 81 82 83 84 85 86 87 88 89 90 91 92 93 94 95 96 97 98 99 100 101 102 103 104 105 106 107 108 109 110 111 112 113 114 5 chunks +23 lines, -9 lines 0 comments Download
M third_party/WebKit/Source/core/dom/Element.cpp View 1 2 3 4 5 6 7 8 9 10 11 12 13 14 15 16 17 18 19 20 21 22 23 24 25 26 27 28 29 30 31 32 33 34 35 36 37 38 39 40 41 42 43 44 45 46 47 48 49 50 51 52 53 54 55 56 57 58 59 60 61 62 63 64 65 66 67 68 69 70 71 72 73 74 75 76 77 78 79 80 81 82 83 84 85 86 87 88 89 90 91 92 93 94 95 96 97 98 99 100 101 102 103 104 105 106 107 108 109 110 111 112 113 114 115 1 chunk +1 line, -0 lines 0 comments Download
M third_party/WebKit/Source/core/dom/SynchronousMutationNotifier.h View 1 2 3 4 5 6 7 8 9 10 11 12 13 14 15 16 17 18 19 20 21 22 23 24 25 26 27 28 29 30 31 32 33 34 35 36 37 38 39 40 41 42 43 44 45 46 47 48 49 50 51 52 53 54 55 56 57 58 59 60 61 62 63 64 65 66 67 68 69 70 71 72 73 74 75 76 77 78 79 80 81 82 83 84 85 86 87 88 89 90 91 92 93 94 95 96 97 98 99 100 101 102 103 104 105 106 107 108 109 110 111 112 1 chunk +9 lines, -5 lines 0 comments Download
M third_party/WebKit/Source/core/dom/SynchronousMutationNotifier.cpp View 1 2 3 4 5 6 7 8 9 10 11 12 13 14 15 16 17 18 19 20 21 22 23 24 25 26 27 28 29 30 31 32 33 34 35 36 37 38 39 40 41 42 43 44 45 46 47 48 49 50 51 52 53 54 55 56 57 58 59 60 61 62 63 64 65 66 67 68 69 70 71 72 73 74 75 76 77 78 79 80 81 82 83 84 85 86 87 88 89 90 91 92 93 94 95 96 97 98 99 100 101 102 103 104 105 106 107 108 109 110 111 112 2 chunks +30 lines, -17 lines 0 comments Download
M third_party/WebKit/Source/core/dom/SynchronousMutationObserver.h View 1 2 3 4 5 6 7 8 9 10 11 12 13 14 15 16 17 18 19 20 21 22 23 24 25 26 27 28 29 30 31 32 33 34 35 36 37 38 39 40 41 42 43 44 45 46 47 48 49 50 51 52 53 54 55 56 57 58 59 60 61 62 63 64 65 66 67 68 69 70 71 72 73 74 75 76 77 78 79 80 81 82 83 84 85 86 87 88 89 90 91 92 93 94 95 96 97 98 99 100 101 102 103 104 105 106 107 108 109 110 111 112 113 114 1 chunk +16 lines, -23 lines 0 comments Download
M third_party/WebKit/Source/core/dom/SynchronousMutationObserver.cpp View 1 2 3 4 5 6 7 8 9 10 11 12 13 14 15 16 17 18 19 20 21 22 23 24 25 26 27 28 29 30 31 32 33 34 35 36 37 38 39 40 41 42 43 44 45 46 47 48 49 50 51 52 53 54 55 56 57 58 59 60 61 62 63 64 65 66 67 68 69 70 71 72 73 74 75 76 77 78 79 80 81 82 83 84 85 86 87 88 89 90 91 92 93 94 95 96 97 98 99 100 101 102 103 104 105 106 107 108 109 110 111 112 1 chunk +13 lines, -1 line 0 comments Download
M third_party/WebKit/Source/core/dom/Text.cpp View 1 2 3 4 5 6 7 8 9 10 11 12 13 14 15 16 17 18 19 20 21 22 23 24 25 26 27 28 29 30 31 32 33 34 35 36 37 38 39 40 41 42 43 44 45 46 47 48 49 50 51 52 53 54 55 56 57 58 59 60 61 62 63 64 65 66 67 68 69 70 71 72 73 74 75 76 77 78 79 80 81 82 83 84 85 86 87 88 89 90 91 92 93 94 95 96 97 98 99 100 101 102 103 104 105 106 107 108 109 110 111 112 113 114 1 chunk +2 lines, -2 lines 0 comments Download
M third_party/WebKit/Source/core/dom/TreeScopeAdopter.h View 1 2 3 4 5 6 7 8 9 10 11 12 13 14 15 16 17 18 19 20 21 22 23 24 25 26 27 28 29 30 31 32 33 34 35 36 37 38 39 40 41 42 43 44 45 46 47 48 49 50 51 52 53 54 55 56 57 58 59 60 61 62 63 64 65 66 67 68 69 1 chunk +1 line, -1 line 0 comments Download
M third_party/WebKit/Source/core/dom/TreeScopeAdopter.cpp View 1 2 3 4 5 6 7 8 9 10 11 12 13 14 15 16 17 18 19 20 21 22 23 24 25 26 27 28 29 30 31 32 33 34 35 36 37 38 39 40 41 42 43 44 45 46 47 48 49 50 51 52 53 54 55 56 57 58 59 60 61 62 63 64 65 66 67 68 69 70 71 72 73 3 chunks +8 lines, -5 lines 0 comments Download
M third_party/WebKit/Source/core/editing/CaretBase.h View 1 2 3 4 5 6 7 8 9 10 11 12 13 14 15 16 17 18 19 20 21 22 23 24 25 26 27 28 29 30 31 32 33 34 35 36 37 38 39 40 41 42 43 44 45 46 47 48 49 50 51 52 53 54 55 56 57 58 59 60 61 62 63 64 65 66 67 68 69 70 71 72 73 74 75 76 77 78 79 80 81 82 83 84 85 86 87 88 89 90 91 92 93 94 95 96 97 98 99 100 101 102 103 104 105 106 107 108 109 110 111 112 113 114 115 4 chunks +6 lines, -23 lines 0 comments Download
M third_party/WebKit/Source/core/editing/CaretBase.cpp View 1 2 3 4 5 6 7 8 9 10 11 12 13 14 15 16 17 18 19 20 21 22 23 24 25 26 27 28 29 30 31 32 33 34 35 36 37 38 39 40 41 42 43 44 45 46 47 48 49 50 51 52 53 54 55 56 57 58 59 60 61 62 63 64 65 66 67 68 69 70 71 72 73 74 75 76 77 78 79 80 81 82 83 84 85 86 87 88 89 90 91 92 93 94 95 96 97 98 99 100 101 102 103 104 105 106 107 108 109 110 111 112 113 114 115 5 chunks +2 lines, -30 lines 0 comments Download
M third_party/WebKit/Source/core/editing/DragCaretController.h View 1 2 3 4 5 6 7 8 9 10 11 12 13 14 15 16 17 18 19 20 21 22 23 24 25 26 27 28 29 30 31 32 33 34 35 36 37 38 39 40 41 42 43 44 45 46 47 48 49 50 51 52 53 54 55 56 57 58 59 60 61 62 63 64 65 66 67 68 69 70 71 72 73 74 75 76 77 78 79 80 81 82 83 84 85 86 87 88 89 90 91 92 93 94 95 96 97 98 99 100 101 102 103 104 105 106 107 108 109 110 111 112 113 114 2 chunks +2 lines, -1 line 0 comments Download
M third_party/WebKit/Source/core/editing/DragCaretController.cpp View 1 2 3 4 5 6 7 8 9 10 11 12 13 14 15 16 17 18 19 20 21 22 23 24 25 26 27 28 29 30 31 32 33 34 35 36 37 38 39 40 41 42 43 44 45 46 47 48 49 50 51 52 53 54 55 56 57 58 59 60 61 62 63 64 65 66 67 68 69 70 71 72 73 74 75 76 77 78 79 80 81 82 83 84 85 86 87 88 89 90 91 92 93 94 95 96 97 98 99 100 101 102 103 104 105 106 107 108 109 110 111 112 113 114 115 2 chunks +2 lines, -4 lines 0 comments Download
M third_party/WebKit/Source/core/editing/FrameCaret.h View 1 2 3 4 5 6 7 8 9 10 11 12 13 14 15 16 17 18 19 20 21 22 23 24 25 26 27 28 29 30 31 32 33 34 35 36 37 38 39 40 41 42 43 44 45 46 47 48 49 50 51 52 53 54 55 56 57 58 59 60 61 62 63 64 65 66 67 68 69 70 71 72 73 74 75 76 77 78 79 80 81 82 83 84 85 86 87 88 89 90 91 92 93 94 95 96 97 98 99 100 101 102 103 104 105 106 107 108 109 110 111 112 113 114 4 chunks +36 lines, -12 lines 0 comments Download
M third_party/WebKit/Source/core/editing/FrameCaret.cpp View 1 2 3 4 5 6 7 8 9 10 11 12 13 14 15 16 17 18 19 20 21 22 23 24 25 26 27 28 29 30 31 32 33 34 35 36 37 38 39 40 41 42 43 44 45 46 47 48 49 50 51 52 53 54 55 56 57 58 59 60 61 62 63 64 65 66 67 68 69 70 71 72 73 74 75 76 77 78 79 80 81 82 83 84 85 86 87 88 89 90 91 92 93 94 95 96 97 98 99 100 101 102 103 104 105 106 107 108 109 110 111 112 113 114 115 11 chunks +70 lines, -34 lines 0 comments Download
M third_party/WebKit/Source/core/editing/FrameSelection.h View 1 2 3 4 5 6 7 8 9 10 11 12 13 14 15 16 17 18 19 20 21 22 23 24 25 26 27 28 29 30 31 32 33 34 35 36 37 38 39 40 41 42 43 44 45 46 47 48 49 50 51 52 53 54 55 56 57 58 59 60 61 62 63 64 65 66 67 68 69 70 71 72 73 74 75 76 77 78 79 80 81 82 83 84 85 86 87 88 89 90 91 92 93 94 95 96 97 98 99 100 101 102 103 104 105 106 107 108 109 110 111 112 113 114 115 13 chunks +35 lines, -39 lines 0 comments Download
M third_party/WebKit/Source/core/editing/FrameSelection.cpp View 1 2 3 4 5 6 7 8 9 10 11 12 13 14 15 16 17 18 19 20 21 22 23 24 25 26 27 28 29 30 31 32 33 34 35 36 37 38 39 40 41 42 43 44 45 46 47 48 49 50 51 52 53 54 55 56 57 58 59 60 61 62 63 64 65 66 67 68 69 70 71 72 73 74 75 76 77 78 79 80 81 82 83 84 85 86 87 88 89 90 91 92 93 94 95 96 97 98 99 100 101 102 103 104 105 106 107 108 109 110 111 112 113 114 115 24 chunks +141 lines, -403 lines 0 comments Download
M third_party/WebKit/Source/core/editing/FrameSelectionTest.cpp View 1 2 3 4 5 6 7 8 9 10 11 12 13 14 15 16 17 18 19 20 21 22 23 24 25 26 27 28 29 30 31 32 33 34 35 36 37 38 39 40 41 42 43 44 45 46 47 48 49 50 51 52 53 54 55 56 57 58 59 60 61 62 63 64 65 66 67 68 69 70 71 72 73 74 75 76 77 78 79 80 81 82 83 84 85 86 87 88 89 90 91 92 93 94 95 96 97 98 99 100 101 102 103 104 105 106 107 108 109 110 111 112 113 114 6 chunks +10 lines, -9 lines 0 comments Download
M third_party/WebKit/Source/core/editing/PendingSelection.cpp View 1 2 3 4 5 6 7 8 9 10 11 12 13 14 15 16 17 18 19 20 21 22 23 24 25 26 27 28 29 30 31 32 33 34 35 36 37 38 39 40 41 42 43 44 45 46 47 48 49 50 51 52 53 54 55 56 57 58 59 60 61 62 63 64 65 66 67 68 69 70 71 72 73 74 75 76 77 78 79 80 81 82 83 84 85 86 87 88 89 90 91 92 93 94 95 96 97 98 99 100 101 102 103 104 105 1 chunk +4 lines, -1 line 0 comments Download
M third_party/WebKit/Source/core/editing/Position.h View 1 2 3 4 5 6 7 8 9 10 11 12 13 14 15 16 17 18 19 20 21 22 23 24 25 26 27 28 29 30 31 32 33 34 35 36 37 38 39 40 41 42 43 44 45 46 47 48 49 50 51 52 53 54 55 56 57 58 59 60 61 62 63 64 65 66 67 68 69 70 71 72 73 74 75 76 77 78 79 80 81 82 83 84 85 86 87 88 89 90 91 92 93 94 95 96 97 98 99 100 101 102 103 104 105 106 107 108 109 110 111 112 1 chunk +1 line, -0 lines 0 comments Download
M third_party/WebKit/Source/core/editing/Position.cpp View 1 2 3 4 5 6 7 8 9 10 11 12 13 14 15 16 17 18 19 20 21 22 23 24 25 26 27 28 29 30 31 32 33 34 35 36 37 38 39 40 41 42 43 44 45 46 47 48 49 50 51 52 53 54 55 56 57 58 59 60 61 62 63 64 65 66 67 68 69 70 71 72 73 74 75 76 77 78 79 80 81 82 83 84 85 86 87 88 89 90 91 92 93 94 95 96 97 98 99 100 101 102 103 104 105 106 107 1 chunk +4 lines, -0 lines 0 comments Download
M third_party/WebKit/Source/core/editing/SelectionController.cpp View 1 2 3 4 5 6 7 8 9 10 11 12 13 14 15 16 17 18 19 20 21 22 23 24 25 26 27 28 29 30 31 32 33 34 35 36 37 38 39 40 41 42 43 44 45 46 47 48 49 50 51 52 53 54 55 56 57 58 59 60 61 62 63 64 65 66 67 68 69 70 71 72 73 74 75 76 77 78 79 80 81 82 83 84 85 86 87 88 89 90 91 92 93 94 95 96 97 98 99 100 101 102 103 104 105 106 107 108 109 110 111 112 113 114 6 chunks +10 lines, -9 lines 0 comments Download
M third_party/WebKit/Source/core/editing/SelectionControllerTest.cpp View 1 2 3 4 5 6 7 8 9 10 11 12 13 14 15 16 17 18 19 20 21 22 23 24 25 26 27 28 29 30 31 32 33 34 35 36 37 38 39 40 41 42 43 44 45 46 47 48 49 50 51 52 53 54 55 56 57 58 59 60 61 62 63 64 65 66 67 68 69 70 71 72 73 74 75 76 77 78 79 80 81 1 chunk +1 line, -1 line 0 comments Download
M third_party/WebKit/Source/core/editing/SelectionEditor.h View 1 2 3 4 5 6 7 8 9 10 11 12 13 14 15 16 17 18 19 20 21 22 23 24 25 26 27 28 29 30 31 32 33 34 35 36 37 38 39 40 41 42 43 44 45 46 47 48 49 50 51 52 53 54 55 56 57 58 59 60 61 62 63 64 65 66 67 68 69 70 71 72 73 74 75 76 77 78 79 80 81 82 83 84 85 86 87 88 89 90 91 92 93 94 95 96 97 98 99 100 101 102 103 104 105 106 107 108 109 110 111 112 113 114 3 chunks +50 lines, -25 lines 0 comments Download
M third_party/WebKit/Source/core/editing/SelectionEditor.cpp View 1 2 3 4 5 6 7 8 9 10 11 12 13 14 15 16 17 18 19 20 21 22 23 24 25 26 27 28 29 30 31 32 33 34 35 36 37 38 39 40 41 42 43 44 45 46 47 48 49 50 51 52 53 54 55 56 57 58 59 60 61 62 63 64 65 66 67 68 69 70 71 72 73 74 75 76 77 78 79 80 81 82 83 84 85 86 87 88 89 90 91 92 93 94 95 96 97 98 99 100 101 102 103 104 105 106 107 108 109 110 111 112 113 114 4 chunks +452 lines, -61 lines 0 comments Download
M third_party/WebKit/Source/core/editing/VisibleSelection.h View 1 2 3 4 5 6 7 8 9 10 11 12 13 14 15 16 17 18 19 20 21 22 23 24 25 26 27 28 29 30 31 32 33 34 35 36 37 38 39 40 41 42 43 44 45 46 47 48 49 50 51 52 53 54 55 56 57 58 59 60 61 62 63 64 65 66 67 68 69 70 71 72 73 74 75 76 77 78 79 80 81 82 83 84 85 86 87 88 89 1 chunk +1 line, -0 lines 0 comments Download
M third_party/WebKit/Source/core/editing/VisibleSelection.cpp View 1 2 3 4 5 6 7 8 9 10 11 12 13 14 15 16 17 18 19 20 21 22 23 24 25 26 27 28 29 30 31 32 33 34 35 36 37 38 39 40 41 42 43 44 45 46 47 48 49 50 51 52 53 54 55 56 57 58 59 60 61 62 63 64 65 66 67 68 69 70 71 72 73 74 75 76 77 78 79 80 81 82 83 84 85 86 87 88 89 90 91 92 93 94 95 96 2 chunks +5 lines, -1 line 0 comments Download
M third_party/WebKit/Source/core/editing/commands/CompositeEditCommand.cpp View 1 2 3 4 5 6 7 8 9 10 11 12 13 14 15 16 17 18 19 20 21 22 23 24 25 26 27 28 29 30 31 32 33 34 35 36 37 38 39 40 41 42 43 44 45 46 47 48 49 50 51 52 53 54 55 56 57 58 59 60 61 62 63 64 65 66 67 68 69 70 71 72 73 74 75 76 77 78 79 80 81 82 83 84 85 86 87 88 89 90 91 92 93 94 95 96 97 98 99 100 101 102 103 104 105 106 107 108 109 110 111 112 113 114 115 1 chunk +3 lines, -0 lines 0 comments Download
M third_party/WebKit/Source/core/frame/FrameView.cpp View 1 2 3 4 5 6 7 8 9 10 11 12 13 14 15 16 17 18 19 20 21 22 23 24 25 26 27 28 29 30 31 32 33 34 35 36 37 38 39 40 41 42 43 44 45 46 47 48 49 50 51 52 53 54 55 56 57 58 59 60 61 62 63 64 65 66 67 68 69 70 71 72 73 74 75 76 77 78 79 80 81 82 83 84 85 86 87 88 89 90 91 92 93 94 95 96 97 98 99 100 101 102 103 104 105 106 107 108 109 110 111 112 113 114 2 chunks +2 lines, -4 lines 0 comments Download
M third_party/WebKit/Source/core/layout/LayoutObject.cpp View 1 2 3 4 5 6 7 8 9 10 11 12 13 14 15 16 17 18 19 20 21 22 23 24 25 26 27 28 29 30 31 32 33 34 35 36 37 38 39 40 41 42 43 44 45 46 47 48 49 50 51 52 53 54 55 56 57 58 59 60 61 62 63 64 65 66 67 68 69 70 71 72 73 74 75 76 77 78 79 80 81 82 83 84 85 86 87 88 89 90 91 92 93 94 95 96 97 98 99 100 101 102 103 104 105 106 107 108 109 110 111 112 113 114 1 chunk +12 lines, -3 lines 0 comments Download
M third_party/WebKit/Source/core/page/FocusController.cpp View 1 2 3 4 5 6 7 8 9 10 11 12 13 14 15 16 17 18 19 20 21 22 23 24 25 26 27 28 29 30 31 32 33 34 35 36 37 38 39 40 41 42 43 44 45 46 47 48 49 50 51 52 53 54 55 56 57 58 59 60 61 62 63 64 65 66 67 68 69 70 71 72 73 74 75 76 77 78 79 80 81 82 83 84 85 86 87 88 89 90 91 92 93 94 95 96 97 98 99 100 101 102 103 104 105 106 107 108 109 110 111 112 1 chunk +3 lines, -2 lines 0 comments Download
M third_party/WebKit/Source/web/tests/WebFrameTest.cpp View 1 2 3 4 5 6 7 8 9 10 11 12 13 14 15 16 17 18 19 20 21 22 23 24 25 26 27 28 29 30 31 32 33 34 35 36 37 38 39 40 41 42 43 44 45 46 47 48 49 50 51 52 53 54 55 56 57 58 59 60 61 62 63 64 65 66 67 68 69 70 71 72 73 74 75 76 77 78 79 80 81 82 83 84 85 86 87 88 89 90 91 92 93 94 95 96 97 98 99 100 101 102 103 104 105 106 107 108 109 110 111 112 113 114 2 chunks +5 lines, -3 lines 0 comments Download

Messages

Total messages: 405 (405 generated)
yosin_UTC9
Description was changed from ========== Lazy Visible Seleciton Validation BUG=606499 ========== to ========== Lazy Visible ...
4 years, 7 months ago (2016-05-11 07:22:55 UTC) #1
yosin_UTC9
Description was changed from ========== Lazy Visible Seleciton Validation BUG=603684, 606499 ========== to ========== Lazy ...
4 years, 7 months ago (2016-05-17 09:37:46 UTC) #2
yosin_UTC9
Description was changed from ========== Lazy Visible Seleciton Validation 1. crrev.com/1983003002: Introduce SelectionModifier class 2. ...
4 years, 6 months ago (2016-05-30 09:46:58 UTC) #3
yosin_UTC9
Description was changed from ========== Lazy Visible Seleciton Validation 1. crrev.com/1983003002: Introduce SelectionModifier class 2. ...
4 years, 6 months ago (2016-05-30 09:55:31 UTC) #4
yosin_UTC9
The CQ bit was checked by yosin@chromium.org to run a CQ dry run
4 years, 4 months ago (2016-07-28 09:43:29 UTC) #5
commit-bot: I haz the power
Dry run: CQ is trying da patch. Follow status at https://chromium-cq-status.appspot.com/v2/patch-status/codereview.chromium.org/1958093002/380001
4 years, 4 months ago (2016-07-28 09:43:49 UTC) #6
commit-bot: I haz the power
The CQ bit was unchecked by commit-bot@chromium.org
4 years, 4 months ago (2016-07-28 09:57:04 UTC) #7
commit-bot: I haz the power
Dry run: Try jobs failed on following builders: cast_shell_android on master.tryserver.chromium.android (JOB_FAILED, https://build.chromium.org/p/tryserver.chromium.android/builders/cast_shell_android/builds/103313)
4 years, 4 months ago (2016-07-28 09:57:05 UTC) #8
yosin_UTC9
The CQ bit was checked by yosin@chromium.org to run a CQ dry run
4 years, 4 months ago (2016-08-02 08:46:14 UTC) #9
commit-bot: I haz the power
Dry run: CQ is trying da patch. Follow status at https://chromium-cq-status.appspot.com/v2/patch-status/codereview.chromium.org/1958093002/400001
4 years, 4 months ago (2016-08-02 08:46:21 UTC) #10
commit-bot: I haz the power
The CQ bit was unchecked by commit-bot@chromium.org
4 years, 4 months ago (2016-08-02 08:58:36 UTC) #11
commit-bot: I haz the power
Dry run: Try jobs failed on following builders: linux_chromium_chromeos_ozone_rel_ng on master.tryserver.chromium.linux (JOB_FAILED, http://build.chromium.org/p/tryserver.chromium.linux/builders/linux_chromium_chromeos_ozone_rel_ng/builds/210957)
4 years, 4 months ago (2016-08-02 08:58:37 UTC) #12
yosin_UTC9
Description was changed from ========== Lazy Visible Seleciton Validation 1. crrev.com/1983003002: Introduce SelectionModifier class 2. ...
4 years, 4 months ago (2016-08-03 07:51:34 UTC) #13
yosin_UTC9
Description was changed from ========== Lazy Visible Seleciton Validation 1. crrev.com/1983003002: Introduce SelectionModifier class 2. ...
4 years, 4 months ago (2016-08-03 08:23:16 UTC) #14
yosin_UTC9
Description was changed from ========== Lazy Visible Seleciton Validation 1. crrev.com/1983003002: Introduce SelectionModifier class 2. ...
4 years, 4 months ago (2016-08-03 08:50:44 UTC) #15
yosin_UTC9
The CQ bit was checked by yosin@chromium.org to run a CQ dry run
4 years, 4 months ago (2016-08-03 08:58:14 UTC) #16
commit-bot: I haz the power
Dry run: CQ is trying da patch. Follow status at https://chromium-cq-status.appspot.com/v2/patch-status/codereview.chromium.org/1958093002/420001
4 years, 4 months ago (2016-08-03 08:58:22 UTC) #17
commit-bot: I haz the power
The CQ bit was unchecked by commit-bot@chromium.org
4 years, 4 months ago (2016-08-03 09:13:46 UTC) #18
commit-bot: I haz the power
Dry run: Try jobs failed on following builders: linux_chromium_chromeos_rel_ng on master.tryserver.chromium.linux (JOB_FAILED, http://build.chromium.org/p/tryserver.chromium.linux/builders/linux_chromium_chromeos_rel_ng/builds/254473)
4 years, 4 months ago (2016-08-03 09:13:47 UTC) #19
yosin_UTC9
The CQ bit was checked by yosin@chromium.org to run a CQ dry run
4 years, 4 months ago (2016-08-04 01:22:19 UTC) #20
commit-bot: I haz the power
Dry run: CQ is trying da patch. Follow status at https://chromium-cq-status.appspot.com/v2/patch-status/codereview.chromium.org/1958093002/440001
4 years, 4 months ago (2016-08-04 01:22:45 UTC) #21
commit-bot: I haz the power
The CQ bit was unchecked by commit-bot@chromium.org
4 years, 4 months ago (2016-08-04 01:37:25 UTC) #22
commit-bot: I haz the power
Dry run: Try jobs failed on following builders: cast_shell_android on master.tryserver.chromium.android (JOB_FAILED, https://build.chromium.org/p/tryserver.chromium.android/builders/cast_shell_android/builds/106555) linux_chromium_chromeos_ozone_rel_ng on ...
4 years, 4 months ago (2016-08-04 01:37:26 UTC) #23
yosin_UTC9
Description was changed from ========== Lazy Visible Seleciton Validation 1. crrev.com/1983003002: Introduce SelectionModifier class 2. ...
4 years, 4 months ago (2016-08-04 08:37:50 UTC) #24
yosin_UTC9
The CQ bit was checked by yosin@chromium.org to run a CQ dry run
4 years, 4 months ago (2016-08-04 08:40:03 UTC) #25
commit-bot: I haz the power
Dry run: CQ is trying da patch. Follow status at https://chromium-cq-status.appspot.com/v2/patch-status/codereview.chromium.org/1958093002/480001
4 years, 4 months ago (2016-08-04 08:41:23 UTC) #26
commit-bot: I haz the power
The CQ bit was unchecked by commit-bot@chromium.org
4 years, 4 months ago (2016-08-04 08:58:37 UTC) #27
commit-bot: I haz the power
Dry run: Try jobs failed on following builders: linux_chromium_chromeos_ozone_rel_ng on master.tryserver.chromium.linux (JOB_FAILED, http://build.chromium.org/p/tryserver.chromium.linux/builders/linux_chromium_chromeos_ozone_rel_ng/builds/212511)
4 years, 4 months ago (2016-08-04 08:58:38 UTC) #28
yosin_UTC9
Description was changed from ========== Lazy Visible Seleciton Validation 1. crrev.com/1983003002: Introduce SelectionModifier class 2. ...
4 years, 4 months ago (2016-08-08 01:06:16 UTC) #29
yosin_UTC9
Description was changed from ========== Lazy Visible Seleciton Validation 1. crrev.com/1983003002: Introduce SelectionModifier class 2. ...
4 years, 4 months ago (2016-08-08 08:14:57 UTC) #30
yosin_UTC9
The CQ bit was checked by yosin@chromium.org to run a CQ dry run
4 years, 4 months ago (2016-08-08 10:34:43 UTC) #31
commit-bot: I haz the power
Dry run: CQ is trying da patch. Follow status at https://chromium-cq-status.appspot.com/v2/patch-status/codereview.chromium.org/1958093002/500001
4 years, 4 months ago (2016-08-08 10:34:58 UTC) #32
commit-bot: I haz the power
The CQ bit was unchecked by commit-bot@chromium.org
4 years, 4 months ago (2016-08-08 10:36:50 UTC) #33
commit-bot: I haz the power
Dry run: Try jobs failed on following builders: ios-device on master.tryserver.chromium.mac (JOB_FAILED, http://build.chromium.org/p/tryserver.chromium.mac/builders/ios-device/builds/47699) mac_chromium_rel_ng on ...
4 years, 4 months ago (2016-08-08 10:36:51 UTC) #34
yosin_UTC9
The CQ bit was checked by yosin@chromium.org to run a CQ dry run
4 years, 4 months ago (2016-08-09 09:56:10 UTC) #35
commit-bot: I haz the power
Dry run: CQ is trying da patch. Follow status at https://chromium-cq-status.appspot.com/v2/patch-status/codereview.chromium.org/1958093002/520001
4 years, 4 months ago (2016-08-09 09:56:40 UTC) #36
commit-bot: I haz the power
The CQ bit was unchecked by commit-bot@chromium.org
4 years, 4 months ago (2016-08-09 10:08:33 UTC) #37
commit-bot: I haz the power
Dry run: Try jobs failed on following builders: cast_shell_android on master.tryserver.chromium.android (JOB_FAILED, https://build.chromium.org/p/tryserver.chromium.android/builders/cast_shell_android/builds/108911) linux_chromium_chromeos_ozone_rel_ng on ...
4 years, 4 months ago (2016-08-09 10:08:34 UTC) #38
yosin_UTC9
The CQ bit was checked by yosin@chromium.org to run a CQ dry run
4 years, 4 months ago (2016-08-10 01:51:30 UTC) #39
commit-bot: I haz the power
Dry run: CQ is trying da patch. Follow status at https://chromium-cq-status.appspot.com/v2/patch-status/codereview.chromium.org/1958093002/540001
4 years, 4 months ago (2016-08-10 01:52:24 UTC) #40
commit-bot: I haz the power
The CQ bit was unchecked by commit-bot@chromium.org
4 years, 4 months ago (2016-08-10 02:09:23 UTC) #41
commit-bot: I haz the power
Dry run: Try jobs failed on following builders: chromeos_daisy_chromium_compile_only_ng on master.tryserver.chromium.linux (JOB_FAILED, http://build.chromium.org/p/tryserver.chromium.linux/builders/chromeos_daisy_chromium_compile_only_ng/builds/181159) chromeos_x86-generic_chromium_compile_only_ng on ...
4 years, 4 months ago (2016-08-10 02:09:25 UTC) #42
yosin_UTC9
The CQ bit was checked by yosin@chromium.org to run a CQ dry run
4 years, 4 months ago (2016-08-10 04:11:00 UTC) #43
commit-bot: I haz the power
Dry run: CQ is trying da patch. Follow status at https://chromium-cq-status.appspot.com/v2/patch-status/codereview.chromium.org/1958093002/560001
4 years, 4 months ago (2016-08-10 04:11:35 UTC) #44
commit-bot: I haz the power
The CQ bit was unchecked by commit-bot@chromium.org
4 years, 4 months ago (2016-08-10 04:55:07 UTC) #45
commit-bot: I haz the power
Dry run: Try jobs failed on following builders: cast_shell_linux on master.tryserver.chromium.linux (JOB_FAILED, http://build.chromium.org/p/tryserver.chromium.linux/builders/cast_shell_linux/builds/204924)
4 years, 4 months ago (2016-08-10 04:55:08 UTC) #46
yosin_UTC9
The CQ bit was checked by yosin@chromium.org to run a CQ dry run
4 years, 4 months ago (2016-08-10 10:28:24 UTC) #47
commit-bot: I haz the power
Dry run: CQ is trying da patch. Follow status at https://chromium-cq-status.appspot.com/v2/patch-status/codereview.chromium.org/1958093002/580001
4 years, 4 months ago (2016-08-10 10:28:34 UTC) #48
commit-bot: I haz the power
The CQ bit was unchecked by commit-bot@chromium.org
4 years, 4 months ago (2016-08-10 10:33:17 UTC) #49
commit-bot: I haz the power
Dry run: Try jobs failed on following builders: android_arm64_dbg_recipe on master.tryserver.chromium.android (JOB_FAILED, https://build.chromium.org/p/tryserver.chromium.android/builders/android_arm64_dbg_recipe/builds/109930) android_clang_dbg_recipe on ...
4 years, 4 months ago (2016-08-10 10:33:18 UTC) #50
yosin_UTC9
Description was changed from ========== Lazy Visible Seleciton Validation 1. crrev.com/1983003002: Introduce SelectionModifier class 2. ...
4 years, 4 months ago (2016-08-15 09:17:55 UTC) #51
yosin_UTC9
The CQ bit was checked by yosin@chromium.org to run a CQ dry run
4 years, 4 months ago (2016-08-15 09:18:10 UTC) #52
commit-bot: I haz the power
Dry run: CQ is trying da patch. Follow status at https://chromium-cq-status.appspot.com/v2/patch-status/codereview.chromium.org/1958093002/600001
4 years, 4 months ago (2016-08-15 09:18:24 UTC) #53
commit-bot: I haz the power
The CQ bit was unchecked by commit-bot@chromium.org
4 years, 4 months ago (2016-08-15 09:32:12 UTC) #54
commit-bot: I haz the power
Dry run: Try jobs failed on following builders: cast_shell_android on master.tryserver.chromium.android (JOB_FAILED, https://build.chromium.org/p/tryserver.chromium.android/builders/cast_shell_android/builds/112099)
4 years, 4 months ago (2016-08-15 09:32:13 UTC) #55
yosin_UTC9
The CQ bit was checked by yosin@chromium.org to run a CQ dry run
4 years, 4 months ago (2016-08-16 02:11:32 UTC) #56
commit-bot: I haz the power
Dry run: CQ is trying da patch. Follow status at https://chromium-cq-status.appspot.com/v2/patch-status/codereview.chromium.org/1958093002/620001
4 years, 4 months ago (2016-08-16 02:11:49 UTC) #57
commit-bot: I haz the power
The CQ bit was unchecked by commit-bot@chromium.org
4 years, 4 months ago (2016-08-16 02:14:33 UTC) #58
commit-bot: I haz the power
Dry run: Try jobs failed on following builders: mac_chromium_compile_dbg_ng on master.tryserver.chromium.mac (JOB_FAILED, http://build.chromium.org/p/tryserver.chromium.mac/builders/mac_chromium_compile_dbg_ng/builds/251735) mac_chromium_rel_ng on ...
4 years, 4 months ago (2016-08-16 02:14:34 UTC) #59
yosin_UTC9
The CQ bit was checked by yosin@chromium.org to run a CQ dry run
4 years, 4 months ago (2016-08-16 03:42:52 UTC) #60
commit-bot: I haz the power
Dry run: CQ is trying da patch. Follow status at https://chromium-cq-status.appspot.com/v2/patch-status/codereview.chromium.org/1958093002/640001
4 years, 4 months ago (2016-08-16 03:43:14 UTC) #61
commit-bot: I haz the power
The CQ bit was unchecked by commit-bot@chromium.org
4 years, 4 months ago (2016-08-16 04:08:09 UTC) #62
commit-bot: I haz the power
Dry run: Try jobs failed on following builders: linux_android_rel_ng on master.tryserver.chromium.android (JOB_FAILED, https://build.chromium.org/p/tryserver.chromium.android/builders/linux_android_rel_ng/builds/123228)
4 years, 4 months ago (2016-08-16 04:08:10 UTC) #63
yosin_UTC9
The CQ bit was checked by yosin@chromium.org to run a CQ dry run
4 years, 4 months ago (2016-08-16 04:11:47 UTC) #64
commit-bot: I haz the power
Dry run: CQ is trying da patch. Follow status at https://chromium-cq-status.appspot.com/v2/patch-status/codereview.chromium.org/1958093002/660001
4 years, 4 months ago (2016-08-16 04:12:05 UTC) #65
yosin_UTC9
Description was changed from ========== Lazy Visible Seleciton Validation 1. crrev.com/1983003002: Introduce SelectionModifier class 2. ...
4 years, 4 months ago (2016-08-16 04:30:58 UTC) #66
commit-bot: I haz the power
The CQ bit was unchecked by commit-bot@chromium.org
4 years, 4 months ago (2016-08-16 04:38:42 UTC) #67
commit-bot: I haz the power
Dry run: Try jobs failed on following builders: cast_shell_linux on master.tryserver.chromium.linux (JOB_FAILED, http://build.chromium.org/p/tryserver.chromium.linux/builders/cast_shell_linux/builds/208093)
4 years, 4 months ago (2016-08-16 04:38:43 UTC) #68
yosin_UTC9
The CQ bit was checked by yosin@chromium.org to run a CQ dry run
4 years, 4 months ago (2016-08-16 08:30:16 UTC) #69
commit-bot: I haz the power
Dry run: CQ is trying da patch. Follow status at https://chromium-cq-status.appspot.com/v2/patch-status/codereview.chromium.org/1958093002/660002
4 years, 4 months ago (2016-08-16 08:30:33 UTC) #70
commit-bot: I haz the power
The CQ bit was unchecked by commit-bot@chromium.org
4 years, 4 months ago (2016-08-16 09:01:35 UTC) #71
commit-bot: I haz the power
Dry run: Try jobs failed on following builders: cast_shell_linux on master.tryserver.chromium.linux (JOB_FAILED, http://build.chromium.org/p/tryserver.chromium.linux/builders/cast_shell_linux/builds/208190)
4 years, 4 months ago (2016-08-16 09:01:37 UTC) #72
yosin_UTC9
The CQ bit was checked by yosin@chromium.org to run a CQ dry run
4 years, 4 months ago (2016-08-18 02:28:41 UTC) #73
commit-bot: I haz the power
Dry run: CQ is trying da patch. Follow status at https://chromium-cq-status.appspot.com/v2/patch-status/codereview.chromium.org/1958093002/660002
4 years, 4 months ago (2016-08-18 02:29:01 UTC) #74
commit-bot: I haz the power
The CQ bit was unchecked by commit-bot@chromium.org
4 years, 4 months ago (2016-08-18 02:58:54 UTC) #75
commit-bot: I haz the power
Dry run: Try jobs failed on following builders: cast_shell_linux on master.tryserver.chromium.linux (JOB_FAILED, http://build.chromium.org/p/tryserver.chromium.linux/builders/cast_shell_linux/builds/209552)
4 years, 4 months ago (2016-08-18 02:58:55 UTC) #76
yosin_UTC9
The CQ bit was checked by yosin@chromium.org to run a CQ dry run
4 years, 4 months ago (2016-08-18 07:13:30 UTC) #77
commit-bot: I haz the power
Dry run: CQ is trying da patch. Follow status at https://chromium-cq-status.appspot.com/v2/patch-status/codereview.chromium.org/1958093002/690001
4 years, 4 months ago (2016-08-18 07:13:42 UTC) #78
commit-bot: I haz the power
The CQ bit was unchecked by commit-bot@chromium.org
4 years, 4 months ago (2016-08-18 08:00:28 UTC) #79
commit-bot: I haz the power
Dry run: Try jobs failed on following builders: linux_chromium_chromeos_rel_ng on master.tryserver.chromium.linux (JOB_FAILED, http://build.chromium.org/p/tryserver.chromium.linux/builders/linux_chromium_chromeos_rel_ng/builds/263285)
4 years, 4 months ago (2016-08-18 08:00:30 UTC) #80
yosin_UTC9
The CQ bit was checked by yosin@chromium.org to run a CQ dry run
4 years, 3 months ago (2016-08-23 08:52:12 UTC) #81
commit-bot: I haz the power
Dry run: CQ is trying da patch. Follow status at https://chromium-cq-status.appspot.com/v2/patch-status/codereview.chromium.org/1958093002/710001
4 years, 3 months ago (2016-08-23 08:52:27 UTC) #82
commit-bot: I haz the power
The CQ bit was unchecked by commit-bot@chromium.org
4 years, 3 months ago (2016-08-23 10:18:04 UTC) #83
commit-bot: I haz the power
Dry run: Try jobs failed on following builders: linux_android_rel_ng on master.tryserver.chromium.android (JOB_FAILED, https://build.chromium.org/p/tryserver.chromium.android/builders/linux_android_rel_ng/builds/127753)
4 years, 3 months ago (2016-08-23 10:18:05 UTC) #84
yosin_UTC9
The CQ bit was checked by yosin@chromium.org to run a CQ dry run
4 years, 3 months ago (2016-08-24 06:37:49 UTC) #85
commit-bot: I haz the power
Dry run: CQ is trying da patch. Follow status at https://chromium-cq-status.appspot.com/v2/patch-status/codereview.chromium.org/1958093002/750001
4 years, 3 months ago (2016-08-24 06:38:17 UTC) #86
commit-bot: I haz the power
The CQ bit was unchecked by commit-bot@chromium.org
4 years, 3 months ago (2016-08-24 07:36:06 UTC) #87
commit-bot: I haz the power
Dry run: Try jobs failed on following builders: linux_android_rel_ng on master.tryserver.chromium.android (JOB_FAILED, https://build.chromium.org/p/tryserver.chromium.android/builders/linux_android_rel_ng/builds/128602)
4 years, 3 months ago (2016-08-24 07:36:08 UTC) #88
yosin_UTC9
The CQ bit was checked by yosin@chromium.org to run a CQ dry run
4 years, 3 months ago (2016-08-25 02:35:33 UTC) #89
commit-bot: I haz the power
Dry run: CQ is trying da patch. Follow status at https://chromium-cq-status.appspot.com/v2/patch-status/codereview.chromium.org/1958093002/770001
4 years, 3 months ago (2016-08-25 02:36:05 UTC) #90
commit-bot: I haz the power
The CQ bit was unchecked by commit-bot@chromium.org
4 years, 3 months ago (2016-08-25 03:56:46 UTC) #91
commit-bot: I haz the power
Dry run: Try jobs failed on following builders: mac_chromium_rel_ng on master.tryserver.chromium.mac (JOB_FAILED, http://build.chromium.org/p/tryserver.chromium.mac/builders/mac_chromium_rel_ng/builds/284395)
4 years, 3 months ago (2016-08-25 03:56:47 UTC) #92
yosin_UTC9
The CQ bit was checked by yosin@chromium.org to run a CQ dry run
4 years, 3 months ago (2016-08-25 06:06:08 UTC) #93
commit-bot: I haz the power
Dry run: CQ is trying da patch. Follow status at https://chromium-cq-status.appspot.com/v2/patch-status/codereview.chromium.org/1958093002/790001
4 years, 3 months ago (2016-08-25 06:06:26 UTC) #94
commit-bot: I haz the power
The CQ bit was unchecked by commit-bot@chromium.org
4 years, 3 months ago (2016-08-25 07:04:48 UTC) #95
commit-bot: I haz the power
Dry run: Try jobs failed on following builders: mac_chromium_rel_ng on master.tryserver.chromium.mac (JOB_FAILED, http://build.chromium.org/p/tryserver.chromium.mac/builders/mac_chromium_rel_ng/builds/284482)
4 years, 3 months ago (2016-08-25 07:04:49 UTC) #96
yosin_UTC9
The CQ bit was checked by yosin@chromium.org to run a CQ dry run
4 years, 3 months ago (2016-08-29 08:02:00 UTC) #97
commit-bot: I haz the power
Dry run: CQ is trying da patch. Follow status at https://chromium-cq-status.appspot.com/v2/patch-status/codereview.chromium.org/1958093002/810001
4 years, 3 months ago (2016-08-29 08:02:13 UTC) #98
commit-bot: I haz the power
The CQ bit was unchecked by commit-bot@chromium.org
4 years, 3 months ago (2016-08-29 09:17:22 UTC) #99
commit-bot: I haz the power
Dry run: Exceeded global retry quota
4 years, 3 months ago (2016-08-29 09:17:23 UTC) #100
yosin_UTC9
The CQ bit was checked by yosin@chromium.org to run a CQ dry run
4 years, 3 months ago (2016-08-31 04:17:23 UTC) #101
commit-bot: I haz the power
Dry run: CQ is trying da patch. Follow status at https://chromium-cq-status.appspot.com/v2/patch-status/codereview.chromium.org/1958093002/830001
4 years, 3 months ago (2016-08-31 04:17:45 UTC) #102
commit-bot: I haz the power
The CQ bit was unchecked by commit-bot@chromium.org
4 years, 3 months ago (2016-08-31 04:35:18 UTC) #103
commit-bot: I haz the power
Dry run: Try jobs failed on following builders: linux_chromium_chromeos_compile_dbg_ng on master.tryserver.chromium.linux (JOB_FAILED, http://build.chromium.org/p/tryserver.chromium.linux/builders/linux_chromium_chromeos_compile_dbg_ng/builds/255608) linux_chromium_compile_dbg_ng on ...
4 years, 3 months ago (2016-08-31 04:35:19 UTC) #104
yosin_UTC9
The CQ bit was checked by yosin@chromium.org to run a CQ dry run
4 years, 3 months ago (2016-08-31 08:48:30 UTC) #105
commit-bot: I haz the power
Dry run: CQ is trying da patch. Follow status at https://chromium-cq-status.appspot.com/v2/patch-status/codereview.chromium.org/1958093002/850001
4 years, 3 months ago (2016-08-31 08:49:01 UTC) #106
commit-bot: I haz the power
The CQ bit was unchecked by commit-bot@chromium.org
4 years, 3 months ago (2016-08-31 09:10:52 UTC) #107
commit-bot: I haz the power
Dry run: Try jobs failed on following builders: linux_chromium_compile_dbg_ng on master.tryserver.chromium.linux (JOB_FAILED, http://build.chromium.org/p/tryserver.chromium.linux/builders/linux_chromium_compile_dbg_ng/builds/149726)
4 years, 3 months ago (2016-08-31 09:10:53 UTC) #108
yosin_UTC9
The CQ bit was checked by yosin@chromium.org to run a CQ dry run
4 years, 3 months ago (2016-09-01 09:49:45 UTC) #109
commit-bot: I haz the power
Dry run: CQ is trying da patch. Follow status at https://chromium-cq-status.appspot.com/v2/patch-status/codereview.chromium.org/1958093002/850001
4 years, 3 months ago (2016-09-01 09:49:55 UTC) #110
commit-bot: I haz the power
The CQ bit was unchecked by commit-bot@chromium.org
4 years, 3 months ago (2016-09-01 09:52:30 UTC) #111
commit-bot: I haz the power
Dry run: Try jobs failed on following builders: mac_chromium_rel_ng on master.tryserver.chromium.mac (JOB_FAILED, http://build.chromium.org/p/tryserver.chromium.mac/builders/mac_chromium_rel_ng/builds/288957)
4 years, 3 months ago (2016-09-01 09:52:37 UTC) #112
yosin_UTC9
The CQ bit was checked by yosin@chromium.org to run a CQ dry run
4 years, 3 months ago (2016-09-02 06:50:32 UTC) #113
commit-bot: I haz the power
Dry run: CQ is trying da patch. Follow status at https://chromium-cq-status.appspot.com/v2/patch-status/codereview.chromium.org/1958093002/870001
4 years, 3 months ago (2016-09-02 06:50:43 UTC) #114
commit-bot: I haz the power
The CQ bit was unchecked by commit-bot@chromium.org
4 years, 3 months ago (2016-09-02 06:52:58 UTC) #115
commit-bot: I haz the power
Dry run: Try jobs failed on following builders: mac_chromium_compile_dbg_ng on master.tryserver.chromium.mac (JOB_FAILED, http://build.chromium.org/p/tryserver.chromium.mac/builders/mac_chromium_compile_dbg_ng/builds/262270)
4 years, 3 months ago (2016-09-02 06:53:00 UTC) #116
yosin_UTC9
The CQ bit was checked by yosin@chromium.org to run a CQ dry run
4 years, 3 months ago (2016-09-02 07:28:48 UTC) #117
commit-bot: I haz the power
Dry run: CQ is trying da patch. Follow status at https://chromium-cq-status.appspot.com/v2/patch-status/codereview.chromium.org/1958093002/890001
4 years, 3 months ago (2016-09-02 07:29:08 UTC) #118
commit-bot: I haz the power
The CQ bit was unchecked by commit-bot@chromium.org
4 years, 3 months ago (2016-09-02 08:15:21 UTC) #119
commit-bot: I haz the power
Dry run: Try jobs failed on following builders: linux_android_rel_ng on master.tryserver.chromium.android (JOB_FAILED, https://build.chromium.org/p/tryserver.chromium.android/builders/linux_android_rel_ng/builds/135161)
4 years, 3 months ago (2016-09-02 08:15:22 UTC) #120
yosin_UTC9
The CQ bit was checked by yosin@chromium.org to run a CQ dry run
4 years, 3 months ago (2016-09-05 04:47:28 UTC) #121
commit-bot: I haz the power
Dry run: CQ is trying da patch. Follow status at https://chromium-cq-status.appspot.com/v2/patch-status/codereview.chromium.org/1958093002/910001
4 years, 3 months ago (2016-09-05 04:47:43 UTC) #122
yosin_UTC9
Description was changed from ========== Lazy Visible Seleciton Validation 1. crrev.com/1983003002: Introduce SelectionModifier class 2. ...
4 years, 3 months ago (2016-09-05 05:24:11 UTC) #123
commit-bot: I haz the power
The CQ bit was unchecked by commit-bot@chromium.org
4 years, 3 months ago (2016-09-05 06:11:21 UTC) #124
commit-bot: I haz the power
Dry run: Exceeded global retry quota
4 years, 3 months ago (2016-09-05 06:11:22 UTC) #125
yosin_UTC9
The CQ bit was checked by yosin@chromium.org to run a CQ dry run
4 years, 3 months ago (2016-09-06 09:56:27 UTC) #126
commit-bot: I haz the power
Dry run: CQ is trying da patch. Follow status at https://chromium-cq-status.appspot.com/v2/patch-status/codereview.chromium.org/1958093002/950001
4 years, 3 months ago (2016-09-06 09:56:44 UTC) #127
commit-bot: I haz the power
The CQ bit was unchecked by commit-bot@chromium.org
4 years, 3 months ago (2016-09-06 10:47:23 UTC) #128
commit-bot: I haz the power
Dry run: Try jobs failed on following builders: linux_android_rel_ng on master.tryserver.chromium.android (JOB_FAILED, https://build.chromium.org/p/tryserver.chromium.android/builders/linux_android_rel_ng/builds/136412)
4 years, 3 months ago (2016-09-06 10:47:25 UTC) #129
yosin_UTC9
The CQ bit was checked by yosin@chromium.org to run a CQ dry run
4 years, 3 months ago (2016-09-07 02:20:58 UTC) #130
commit-bot: I haz the power
Dry run: CQ is trying da patch. Follow status at https://chromium-cq-status.appspot.com/v2/patch-status/codereview.chromium.org/1958093002/970001
4 years, 3 months ago (2016-09-07 02:21:08 UTC) #131
yosin_UTC9
Description was changed from ========== Lazy Visible Seleciton Validation 1. crrev.com/1983003002: Introduce SelectionModifier class 2. ...
4 years, 3 months ago (2016-09-07 03:49:00 UTC) #132
commit-bot: I haz the power
The CQ bit was unchecked by commit-bot@chromium.org
4 years, 3 months ago (2016-09-07 03:56:06 UTC) #133
commit-bot: I haz the power
Dry run: Try jobs failed on following builders: linux_chromium_rel_ng on master.tryserver.chromium.linux (JOB_FAILED, http://build.chromium.org/p/tryserver.chromium.linux/builders/linux_chromium_rel_ng/builds/293150)
4 years, 3 months ago (2016-09-07 03:56:07 UTC) #134
yosin_UTC9
Description was changed from ========== Lazy Visible Seleciton Validation 1. crrev.com/1983003002: Introduce SelectionModifier class 2. ...
4 years, 3 months ago (2016-09-07 05:46:58 UTC) #135
yosin_UTC9
The CQ bit was checked by yosin@chromium.org to run a CQ dry run
4 years, 3 months ago (2016-09-07 06:12:55 UTC) #136
commit-bot: I haz the power
Dry run: CQ is trying da patch. Follow status at https://chromium-cq-status.appspot.com/v2/patch-status/codereview.chromium.org/1958093002/990001
4 years, 3 months ago (2016-09-07 06:13:18 UTC) #137
commit-bot: I haz the power
The CQ bit was unchecked by commit-bot@chromium.org
4 years, 3 months ago (2016-09-07 07:43:55 UTC) #138
commit-bot: I haz the power
Dry run: Try jobs failed on following builders: linux_chromium_rel_ng on master.tryserver.chromium.linux (JOB_FAILED, http://build.chromium.org/p/tryserver.chromium.linux/builders/linux_chromium_rel_ng/builds/293230)
4 years, 3 months ago (2016-09-07 07:43:56 UTC) #139
yosin_UTC9
The CQ bit was checked by yosin@chromium.org to run a CQ dry run
4 years, 3 months ago (2016-09-07 09:58:41 UTC) #140
commit-bot: I haz the power
Dry run: CQ is trying da patch. Follow status at https://chromium-cq-status.appspot.com/v2/patch-status/codereview.chromium.org/1958093002/1010001
4 years, 3 months ago (2016-09-07 09:59:01 UTC) #141
commit-bot: I haz the power
The CQ bit was unchecked by commit-bot@chromium.org
4 years, 3 months ago (2016-09-07 11:20:33 UTC) #142
commit-bot: I haz the power
Dry run: Try jobs failed on following builders: linux_chromium_rel_ng on master.tryserver.chromium.linux (JOB_FAILED, http://build.chromium.org/p/tryserver.chromium.linux/builders/linux_chromium_rel_ng/builds/293324)
4 years, 3 months ago (2016-09-07 11:20:35 UTC) #143
yosin_UTC9
The CQ bit was checked by yosin@chromium.org to run a CQ dry run
4 years, 3 months ago (2016-09-08 06:15:25 UTC) #144
commit-bot: I haz the power
Dry run: CQ is trying da patch. Follow status at https://chromium-cq-status.appspot.com/v2/patch-status/codereview.chromium.org/1958093002/1030001
4 years, 3 months ago (2016-09-08 06:15:40 UTC) #145
commit-bot: I haz the power
The CQ bit was unchecked by commit-bot@chromium.org
4 years, 3 months ago (2016-09-08 07:50:43 UTC) #146
commit-bot: I haz the power
Dry run: Try jobs failed on following builders: linux_chromium_rel_ng on master.tryserver.chromium.linux (JOB_FAILED, http://build.chromium.org/p/tryserver.chromium.linux/builders/linux_chromium_rel_ng/builds/294080)
4 years, 3 months ago (2016-09-08 07:50:45 UTC) #147
yosin_UTC9
The CQ bit was checked by yosin@chromium.org to run a CQ dry run
4 years, 3 months ago (2016-09-08 10:48:26 UTC) #148
commit-bot: I haz the power
Dry run: CQ is trying da patch. Follow status at https://chromium-cq-status.appspot.com/v2/patch-status/codereview.chromium.org/1958093002/1050001
4 years, 3 months ago (2016-09-08 10:48:39 UTC) #149
commit-bot: I haz the power
The CQ bit was unchecked by commit-bot@chromium.org
4 years, 3 months ago (2016-09-08 10:51:08 UTC) #150
commit-bot: I haz the power
Dry run: Try jobs failed on following builders: mac_chromium_rel_ng on master.tryserver.chromium.mac (JOB_FAILED, http://build.chromium.org/p/tryserver.chromium.mac/builders/mac_chromium_rel_ng/builds/292750)
4 years, 3 months ago (2016-09-08 10:51:09 UTC) #151
yosin_UTC9
The CQ bit was checked by yosin@chromium.org to run a CQ dry run
4 years, 3 months ago (2016-09-09 07:03:49 UTC) #152
commit-bot: I haz the power
Dry run: CQ is trying da patch. Follow status at https://chromium-cq-status.appspot.com/v2/patch-status/codereview.chromium.org/1958093002/1070001
4 years, 3 months ago (2016-09-09 07:04:03 UTC) #153
commit-bot: I haz the power
The CQ bit was unchecked by commit-bot@chromium.org
4 years, 3 months ago (2016-09-09 07:16:00 UTC) #154
commit-bot: I haz the power
Dry run: Try jobs failed on following builders: linux_chromium_chromeos_ozone_rel_ng on master.tryserver.chromium.linux (JOB_FAILED, http://build.chromium.org/p/tryserver.chromium.linux/builders/linux_chromium_chromeos_ozone_rel_ng/builds/232952)
4 years, 3 months ago (2016-09-09 07:16:01 UTC) #155
yosin_UTC9
The CQ bit was checked by yosin@chromium.org to run a CQ dry run
4 years, 3 months ago (2016-09-09 07:49:27 UTC) #156
commit-bot: I haz the power
Dry run: CQ is trying da patch. Follow status at https://chromium-cq-status.appspot.com/v2/patch-status/codereview.chromium.org/1958093002/1090001
4 years, 3 months ago (2016-09-09 07:49:49 UTC) #157
commit-bot: I haz the power
The CQ bit was unchecked by commit-bot@chromium.org
4 years, 3 months ago (2016-09-09 08:11:22 UTC) #158
commit-bot: I haz the power
Dry run: Try jobs failed on following builders: linux_chromium_chromeos_ozone_rel_ng on master.tryserver.chromium.linux (JOB_FAILED, http://build.chromium.org/p/tryserver.chromium.linux/builders/linux_chromium_chromeos_ozone_rel_ng/builds/232969)
4 years, 3 months ago (2016-09-09 08:11:24 UTC) #159
yosin_UTC9
Description was changed from ========== Lazy Visible Seleciton Validation 1. crrev.com/1983003002: Introduce SelectionModifier class 2. ...
4 years, 3 months ago (2016-09-09 08:43:14 UTC) #160
yosin_UTC9
The CQ bit was checked by yosin@chromium.org to run a CQ dry run
4 years, 3 months ago (2016-09-09 08:43:38 UTC) #161
commit-bot: I haz the power
Dry run: CQ is trying da patch. Follow status at https://chromium-cq-status.appspot.com/v2/patch-status/codereview.chromium.org/1958093002/1110001
4 years, 3 months ago (2016-09-09 08:43:59 UTC) #162
commit-bot: I haz the power
The CQ bit was unchecked by commit-bot@chromium.org
4 years, 3 months ago (2016-09-09 08:54:10 UTC) #163
commit-bot: I haz the power
Dry run: Try jobs failed on following builders: linux_layout_tests_slimming_paint_v2 on master.tryserver.chromium.linux (JOB_FAILED, http://build.chromium.org/p/tryserver.chromium.linux/builders/linux_layout_tests_slimming_paint_v2/builds/429)
4 years, 3 months ago (2016-09-09 08:54:12 UTC) #164
yosin_UTC9
The CQ bit was checked by yosin@chromium.org to run a CQ dry run
4 years, 3 months ago (2016-09-09 09:33:02 UTC) #165
commit-bot: I haz the power
Dry run: CQ is trying da patch. Follow status at https://chromium-cq-status.appspot.com/v2/patch-status/codereview.chromium.org/1958093002/1130001
4 years, 3 months ago (2016-09-09 09:33:15 UTC) #166
commit-bot: I haz the power
The CQ bit was unchecked by commit-bot@chromium.org
4 years, 3 months ago (2016-09-09 10:19:53 UTC) #167
commit-bot: I haz the power
Dry run: Try jobs failed on following builders: linux_layout_tests_slimming_paint_v2 on master.tryserver.chromium.linux (JOB_FAILED, http://build.chromium.org/p/tryserver.chromium.linux/builders/linux_layout_tests_slimming_paint_v2/builds/432)
4 years, 3 months ago (2016-09-09 10:19:55 UTC) #168
yosin_UTC9
The CQ bit was checked by yosin@chromium.org to run a CQ dry run
4 years, 3 months ago (2016-09-12 09:25:17 UTC) #169
commit-bot: I haz the power
Dry run: CQ is trying da patch. Follow status at https://chromium-cq-status.appspot.com/v2/patch-status/codereview.chromium.org/1958093002/1150001
4 years, 3 months ago (2016-09-12 09:25:33 UTC) #170
commit-bot: I haz the power
The CQ bit was unchecked by commit-bot@chromium.org
4 years, 3 months ago (2016-09-12 10:11:31 UTC) #171
commit-bot: I haz the power
Dry run: Try jobs failed on following builders: linux_android_rel_ng on master.tryserver.chromium.android (JOB_FAILED, https://build.chromium.org/p/tryserver.chromium.android/builders/linux_android_rel_ng/builds/139772)
4 years, 3 months ago (2016-09-12 10:11:32 UTC) #172
yosin_UTC9
The CQ bit was checked by yosin@chromium.org to run a CQ dry run
4 years, 3 months ago (2016-09-13 06:57:21 UTC) #173
commit-bot: I haz the power
Dry run: CQ is trying da patch. Follow status at https://chromium-cq-status.appspot.com/v2/patch-status/codereview.chromium.org/1958093002/1170001
4 years, 3 months ago (2016-09-13 06:57:34 UTC) #174
commit-bot: I haz the power
The CQ bit was unchecked by commit-bot@chromium.org
4 years, 3 months ago (2016-09-13 07:44:00 UTC) #175
commit-bot: I haz the power
Dry run: Try jobs failed on following builders: linux_layout_tests_slimming_paint_v2 on master.tryserver.chromium.linux (JOB_FAILED, http://build.chromium.org/p/tryserver.chromium.linux/builders/linux_layout_tests_slimming_paint_v2/builds/485)
4 years, 3 months ago (2016-09-13 07:44:02 UTC) #176
yosin_UTC9
The CQ bit was checked by yosin@chromium.org to run a CQ dry run
4 years, 3 months ago (2016-09-16 08:47:05 UTC) #177
commit-bot: I haz the power
Dry run: CQ is trying da patch. Follow status at https://chromium-cq-status.appspot.com/v2/patch-status/codereview.chromium.org/1958093002/1210001
4 years, 3 months ago (2016-09-16 08:47:12 UTC) #178
commit-bot: I haz the power
The CQ bit was unchecked by commit-bot@chromium.org
4 years, 3 months ago (2016-09-16 09:43:03 UTC) #179
commit-bot: I haz the power
Dry run: Try jobs failed on following builders: linux_layout_tests_slimming_paint_v2 on master.tryserver.chromium.linux (JOB_FAILED, http://build.chromium.org/p/tryserver.chromium.linux/builders/linux_layout_tests_slimming_paint_v2/builds/561)
4 years, 3 months ago (2016-09-16 09:43:05 UTC) #180
yosin_UTC9
The CQ bit was checked by yosin@chromium.org to run a CQ dry run
4 years, 2 months ago (2016-09-26 05:54:14 UTC) #181
commit-bot: I haz the power
Dry run: CQ is trying da patch. Follow status at https://chromium-cq-status.appspot.com/v2/patch-status/codereview.chromium.org/1958093002/1230001
4 years, 2 months ago (2016-09-26 05:54:32 UTC) #182
commit-bot: I haz the power
The CQ bit was unchecked by commit-bot@chromium.org
4 years, 2 months ago (2016-09-26 06:36:07 UTC) #183
commit-bot: I haz the power
Dry run: Try jobs failed on following builders: linux_layout_tests_slimming_paint_v2 on master.tryserver.chromium.linux (JOB_FAILED, http://build.chromium.org/p/tryserver.chromium.linux/builders/linux_layout_tests_slimming_paint_v2/builds/708)
4 years, 2 months ago (2016-09-26 06:36:09 UTC) #184
yosin_UTC9
Description was changed from ========== Lazy Visible Seleciton Validation 1. crrev.com/1983003002: Introduce SelectionModifier class 2. ...
4 years, 2 months ago (2016-09-26 07:04:22 UTC) #185
yosin_UTC9
The CQ bit was checked by yosin@chromium.org to run a CQ dry run
4 years, 2 months ago (2016-09-26 09:02:57 UTC) #186
commit-bot: I haz the power
Dry run: CQ is trying da patch. Follow status at https://chromium-cq-status.appspot.com/v2/patch-status/codereview.chromium.org/1958093002/1250001
4 years, 2 months ago (2016-09-26 09:03:16 UTC) #187
commit-bot: I haz the power
The CQ bit was unchecked by commit-bot@chromium.org
4 years, 2 months ago (2016-09-26 09:55:11 UTC) #188
commit-bot: I haz the power
Dry run: Try jobs failed on following builders: linux_layout_tests_slimming_paint_v2 on master.tryserver.chromium.linux (JOB_FAILED, http://build.chromium.org/p/tryserver.chromium.linux/builders/linux_layout_tests_slimming_paint_v2/builds/711)
4 years, 2 months ago (2016-09-26 09:55:13 UTC) #189
yosin_UTC9
The CQ bit was checked by yosin@chromium.org to run a CQ dry run
4 years, 2 months ago (2016-09-26 10:02:50 UTC) #190
commit-bot: I haz the power
Dry run: CQ is trying da patch. Follow status at https://chromium-cq-status.appspot.com/v2/patch-status/codereview.chromium.org/1958093002/1270001
4 years, 2 months ago (2016-09-26 10:03:17 UTC) #191
commit-bot: I haz the power
The CQ bit was unchecked by commit-bot@chromium.org
4 years, 2 months ago (2016-09-26 11:01:04 UTC) #192
commit-bot: I haz the power
Dry run: Try jobs failed on following builders: linux_layout_tests_slimming_paint_v2 on master.tryserver.chromium.linux (JOB_FAILED, http://build.chromium.org/p/tryserver.chromium.linux/builders/linux_layout_tests_slimming_paint_v2/builds/713)
4 years, 2 months ago (2016-09-26 11:01:06 UTC) #193
yosin_UTC9
Description was changed from ========== Lazy Visible Seleciton Validation 1. crrev.com/1983003002: Introduce SelectionModifier class 2. ...
4 years, 2 months ago (2016-09-27 02:29:45 UTC) #194
yosin_UTC9
The CQ bit was checked by yosin@chromium.org to run a CQ dry run
4 years, 2 months ago (2016-09-27 10:14:36 UTC) #195
commit-bot: I haz the power
Dry run: CQ is trying da patch. Follow status at https://chromium-cq-status.appspot.com/v2/patch-status/codereview.chromium.org/1958093002/1310001
4 years, 2 months ago (2016-09-27 10:14:46 UTC) #196
commit-bot: I haz the power
The CQ bit was unchecked by commit-bot@chromium.org
4 years, 2 months ago (2016-09-27 10:58:42 UTC) #197
commit-bot: I haz the power
Dry run: Try jobs failed on following builders: linux_layout_tests_slimming_paint_v2 on master.tryserver.chromium.linux (JOB_FAILED, http://build.chromium.org/p/tryserver.chromium.linux/builders/linux_layout_tests_slimming_paint_v2/builds/746)
4 years, 2 months ago (2016-09-27 10:58:44 UTC) #198
yosin_UTC9
The CQ bit was checked by yosin@chromium.org to run a CQ dry run
4 years, 2 months ago (2016-09-28 10:41:54 UTC) #199
commit-bot: I haz the power
Dry run: CQ is trying da patch. Follow status at https://chromium-cq-status.appspot.com/v2/patch-status/codereview.chromium.org/1958093002/1330001
4 years, 2 months ago (2016-09-28 10:42:04 UTC) #200
commit-bot: I haz the power
The CQ bit was unchecked by commit-bot@chromium.org
4 years, 2 months ago (2016-09-28 10:44:39 UTC) #201
commit-bot: I haz the power
Dry run: Try jobs failed on following builders: ios-device on master.tryserver.chromium.mac (JOB_FAILED, http://build.chromium.org/p/tryserver.chromium.mac/builders/ios-device/builds/76414) ios-simulator on ...
4 years, 2 months ago (2016-09-28 10:44:41 UTC) #202
yosin_UTC9
The CQ bit was checked by yosin@chromium.org to run a CQ dry run
4 years, 2 months ago (2016-09-29 11:00:30 UTC) #203
commit-bot: I haz the power
Dry run: CQ is trying da patch. Follow status at https://chromium-cq-status.appspot.com/v2/patch-status/codereview.chromium.org/1958093002/1350001
4 years, 2 months ago (2016-09-29 11:00:44 UTC) #204
commit-bot: I haz the power
The CQ bit was unchecked by commit-bot@chromium.org
4 years, 2 months ago (2016-09-29 11:03:41 UTC) #205
commit-bot: I haz the power
Dry run: Try jobs failed on following builders: mac_chromium_compile_dbg_ng on master.tryserver.chromium.mac (JOB_FAILED, http://build.chromium.org/p/tryserver.chromium.mac/builders/mac_chromium_compile_dbg_ng/builds/276913)
4 years, 2 months ago (2016-09-29 11:03:43 UTC) #206
yosin_UTC9
The CQ bit was checked by yosin@chromium.org to run a CQ dry run
4 years, 2 months ago (2016-10-03 08:07:25 UTC) #207
commit-bot: I haz the power
Dry run: CQ is trying da patch. Follow status at https://chromium-cq-status.appspot.com/v2/patch-status/codereview.chromium.org/1958093002/1370001
4 years, 2 months ago (2016-10-03 08:07:41 UTC) #208
commit-bot: I haz the power
The CQ bit was unchecked by commit-bot@chromium.org
4 years, 2 months ago (2016-10-03 08:09:56 UTC) #209
commit-bot: I haz the power
Dry run: Try jobs failed on following builders: ios-device on master.tryserver.chromium.mac (JOB_FAILED, http://build.chromium.org/p/tryserver.chromium.mac/builders/ios-device/builds/78985) ios-simulator on ...
4 years, 2 months ago (2016-10-03 08:09:58 UTC) #210
yosin_UTC9
The CQ bit was checked by yosin@chromium.org to run a CQ dry run
4 years, 2 months ago (2016-10-03 10:05:54 UTC) #211
commit-bot: I haz the power
Dry run: CQ is trying da patch. Follow status at https://chromium-cq-status.appspot.com/v2/patch-status/codereview.chromium.org/1958093002/1390001
4 years, 2 months ago (2016-10-03 10:06:13 UTC) #212
commit-bot: I haz the power
The CQ bit was unchecked by commit-bot@chromium.org
4 years, 2 months ago (2016-10-03 10:08:38 UTC) #213
commit-bot: I haz the power
Dry run: Try jobs failed on following builders: chromium_presubmit on master.tryserver.chromium.linux (JOB_FAILED, http://build.chromium.org/p/tryserver.chromium.linux/builders/chromium_presubmit/builds/271801) ios-device on ...
4 years, 2 months ago (2016-10-03 10:08:40 UTC) #214
yosin_UTC9
The CQ bit was checked by yosin@chromium.org to run a CQ dry run
4 years, 2 months ago (2016-10-06 05:37:13 UTC) #215
commit-bot: I haz the power
Dry run: CQ is trying da patch. Follow status at https://chromium-cq-status.appspot.com/v2/patch-status/codereview.chromium.org/1958093002/1430001
4 years, 2 months ago (2016-10-06 05:37:36 UTC) #216
commit-bot: I haz the power
The CQ bit was unchecked by commit-bot@chromium.org
4 years, 2 months ago (2016-10-06 05:41:57 UTC) #217
commit-bot: I haz the power
Dry run: Try jobs failed on following builders: android_arm64_dbg_recipe on master.tryserver.chromium.android (JOB_FAILED, https://build.chromium.org/p/tryserver.chromium.android/builders/android_arm64_dbg_recipe/builds/140843) android_clang_dbg_recipe on ...
4 years, 2 months ago (2016-10-06 05:42:01 UTC) #218
yosin_UTC9
The CQ bit was checked by yosin@chromium.org to run a CQ dry run
4 years, 2 months ago (2016-10-07 08:44:29 UTC) #219
commit-bot: I haz the power
Dry run: CQ is trying da patch. Follow status at https://chromium-cq-status.appspot.com/v2/patch-status/codereview.chromium.org/1958093002/1450001
4 years, 2 months ago (2016-10-07 08:44:50 UTC) #220
commit-bot: I haz the power
The CQ bit was unchecked by commit-bot@chromium.org
4 years, 2 months ago (2016-10-07 08:58:38 UTC) #221
commit-bot: I haz the power
Dry run: Try jobs failed on following builders: cast_shell_android on master.tryserver.chromium.android (JOB_FAILED, https://build.chromium.org/p/tryserver.chromium.android/builders/cast_shell_android/builds/141657) linux_layout_tests_slimming_paint_v2 on ...
4 years, 2 months ago (2016-10-07 08:58:40 UTC) #222
yosin_UTC9
The CQ bit was checked by yosin@chromium.org to run a CQ dry run
4 years, 2 months ago (2016-10-07 09:55:24 UTC) #223
commit-bot: I haz the power
Dry run: CQ is trying da patch. Follow status at https://chromium-cq-status.appspot.com/v2/patch-status/codereview.chromium.org/1958093002/1470001
4 years, 2 months ago (2016-10-07 09:55:44 UTC) #224
commit-bot: I haz the power
The CQ bit was unchecked by commit-bot@chromium.org
4 years, 2 months ago (2016-10-07 10:04:39 UTC) #225
commit-bot: I haz the power
Dry run: Try jobs failed on following builders: cast_shell_android on master.tryserver.chromium.android (JOB_FAILED, https://build.chromium.org/p/tryserver.chromium.android/builders/cast_shell_android/builds/141680)
4 years, 2 months ago (2016-10-07 10:04:41 UTC) #226
yosin_UTC9
The CQ bit was checked by yosin@chromium.org to run a CQ dry run
4 years, 2 months ago (2016-10-07 10:12:59 UTC) #227
commit-bot: I haz the power
Dry run: CQ is trying da patch. Follow status at https://chromium-cq-status.appspot.com/v2/patch-status/codereview.chromium.org/1958093002/1490001
4 years, 2 months ago (2016-10-07 10:13:15 UTC) #228
commit-bot: I haz the power
The CQ bit was unchecked by commit-bot@chromium.org
4 years, 2 months ago (2016-10-07 10:24:52 UTC) #229
commit-bot: I haz the power
Dry run: Try jobs failed on following builders: chromeos_amd64-generic_chromium_compile_only_ng on master.tryserver.chromium.linux (JOB_FAILED, http://build.chromium.org/p/tryserver.chromium.linux/builders/chromeos_amd64-generic_chromium_compile_only_ng/builds/212887)
4 years, 2 months ago (2016-10-07 10:24:54 UTC) #230
yosin_UTC9
The CQ bit was checked by yosin@chromium.org to run a CQ dry run
4 years, 2 months ago (2016-10-12 09:07:24 UTC) #231
commit-bot: I haz the power
Dry run: CQ is trying da patch. Follow status at https://chromium-cq-status.appspot.com/v2/patch-status/codereview.chromium.org/1958093002/1510001
4 years, 2 months ago (2016-10-12 09:07:44 UTC) #232
commit-bot: I haz the power
The CQ bit was unchecked by commit-bot@chromium.org
4 years, 2 months ago (2016-10-12 09:23:17 UTC) #233
commit-bot: I haz the power
Dry run: Try jobs failed on following builders: cast_shell_android on master.tryserver.chromium.android (JOB_FAILED, https://build.chromium.org/p/tryserver.chromium.android/builders/cast_shell_android/builds/143971)
4 years, 2 months ago (2016-10-12 09:23:19 UTC) #234
yosin_UTC9
The CQ bit was checked by yosin@chromium.org to run a CQ dry run
4 years, 2 months ago (2016-10-13 01:02:15 UTC) #235
commit-bot: I haz the power
Dry run: CQ is trying da patch. Follow status at https://chromium-cq-status.appspot.com/v2/patch-status/codereview.chromium.org/1958093002/1530001
4 years, 2 months ago (2016-10-13 01:02:34 UTC) #236
commit-bot: I haz the power
The CQ bit was unchecked by commit-bot@chromium.org
4 years, 2 months ago (2016-10-13 01:04:59 UTC) #237
commit-bot: I haz the power
Dry run: Try jobs failed on following builders: ios-device on master.tryserver.chromium.mac (JOB_FAILED, http://build.chromium.org/p/tryserver.chromium.mac/builders/ios-device/builds/85689) ios-simulator on ...
4 years, 2 months ago (2016-10-13 01:05:01 UTC) #238
yosin_UTC9
Description was changed from ========== Lazy Visible Seleciton Validation 1. crrev.com/1983003002: Introduce SelectionModifier class 2. ...
4 years, 2 months ago (2016-10-13 04:00:38 UTC) #239
yosin_UTC9
The CQ bit was checked by yosin@chromium.org to run a CQ dry run
4 years, 2 months ago (2016-10-13 05:44:29 UTC) #240
commit-bot: I haz the power
Dry run: CQ is trying da patch. Follow status at https://chromium-cq-status.appspot.com/v2/patch-status/codereview.chromium.org/1958093002/1550001
4 years, 2 months ago (2016-10-13 05:44:45 UTC) #241
commit-bot: I haz the power
The CQ bit was unchecked by commit-bot@chromium.org
4 years, 2 months ago (2016-10-13 05:56:58 UTC) #242
commit-bot: I haz the power
Dry run: Try jobs failed on following builders: chromeos_amd64-generic_chromium_compile_only_ng on master.tryserver.chromium.linux (JOB_FAILED, http://build.chromium.org/p/tryserver.chromium.linux/builders/chromeos_amd64-generic_chromium_compile_only_ng/builds/215844)
4 years, 2 months ago (2016-10-13 05:57:01 UTC) #243
yosin_UTC9
The CQ bit was checked by yosin@chromium.org to run a CQ dry run
4 years, 1 month ago (2016-10-25 10:07:12 UTC) #244
commit-bot: I haz the power
Dry run: CQ is trying da patch. Follow status at https://chromium-cq-status.appspot.com/v2/patch-status/codereview.chromium.org/1958093002/1570001
4 years, 1 month ago (2016-10-25 10:07:30 UTC) #245
commit-bot: I haz the power
The CQ bit was unchecked by commit-bot@chromium.org
4 years, 1 month ago (2016-10-25 10:26:27 UTC) #246
commit-bot: I haz the power
Dry run: Try jobs failed on following builders: cast_shell_linux on master.tryserver.chromium.linux (JOB_FAILED, http://build.chromium.org/p/tryserver.chromium.linux/builders/cast_shell_linux/builds/248015) linux_chromium_asan_rel_ng on ...
4 years, 1 month ago (2016-10-25 10:26:29 UTC) #247
yosin_UTC9
The CQ bit was checked by yosin@chromium.org to run a CQ dry run
4 years, 1 month ago (2016-10-26 04:49:38 UTC) #248
commit-bot: I haz the power
Dry run: CQ is trying da patch. Follow status at https://chromium-cq-status.appspot.com/v2/patch-status/codereview.chromium.org/1958093002/1590001
4 years, 1 month ago (2016-10-26 04:49:57 UTC) #249
commit-bot: I haz the power
The CQ bit was unchecked by commit-bot@chromium.org
4 years, 1 month ago (2016-10-26 05:04:52 UTC) #250
commit-bot: I haz the power
Dry run: Try jobs failed on following builders: chromeos_daisy_chromium_compile_only_ng on master.tryserver.chromium.linux (JOB_FAILED, http://build.chromium.org/p/tryserver.chromium.linux/builders/chromeos_daisy_chromium_compile_only_ng/builds/223495) linux_chromium_chromeos_ozone_rel_ng on ...
4 years, 1 month ago (2016-10-26 05:04:54 UTC) #251
yosin_UTC9
The CQ bit was checked by yosin@chromium.org to run a CQ dry run
4 years, 1 month ago (2016-10-28 06:51:14 UTC) #252
commit-bot: I haz the power
Dry run: CQ is trying da patch. Follow status at https://chromium-cq-status.appspot.com/v2/patch-status/codereview.chromium.org/1958093002/1610001
4 years, 1 month ago (2016-10-28 06:51:25 UTC) #253
commit-bot: I haz the power
The CQ bit was unchecked by commit-bot@chromium.org
4 years, 1 month ago (2016-10-28 07:15:18 UTC) #254
commit-bot: I haz the power
Dry run: Try jobs failed on following builders: linux_chromium_rel_ng on master.tryserver.chromium.linux (JOB_FAILED, http://build.chromium.org/p/tryserver.chromium.linux/builders/linux_chromium_rel_ng/builds/326565)
4 years, 1 month ago (2016-10-28 07:15:20 UTC) #255
yosin_UTC9
The CQ bit was checked by yosin@chromium.org to run a CQ dry run
4 years, 1 month ago (2016-10-28 10:24:16 UTC) #256
commit-bot: I haz the power
Dry run: CQ is trying da patch. Follow status at https://chromium-cq-status.appspot.com/v2/patch-status/codereview.chromium.org/1958093002/1630001
4 years, 1 month ago (2016-10-28 10:24:24 UTC) #257
commit-bot: I haz the power
The CQ bit was unchecked by commit-bot@chromium.org
4 years, 1 month ago (2016-10-28 10:38:32 UTC) #258
commit-bot: I haz the power
Dry run: Try jobs failed on following builders: cast_shell_linux on master.tryserver.chromium.linux (JOB_FAILED, http://build.chromium.org/p/tryserver.chromium.linux/builders/cast_shell_linux/builds/250608) linux_chromium_chromeos_ozone_rel_ng on ...
4 years, 1 month ago (2016-10-28 10:38:34 UTC) #259
yosin_UTC9
The CQ bit was checked by yosin@chromium.org to run a CQ dry run
4 years, 1 month ago (2016-10-31 05:25:42 UTC) #260
commit-bot: I haz the power
Dry run: CQ is trying da patch. Follow status at https://chromium-cq-status.appspot.com/v2/patch-status/codereview.chromium.org/1958093002/1650001
4 years, 1 month ago (2016-10-31 05:25:58 UTC) #261
commit-bot: I haz the power
The CQ bit was unchecked by commit-bot@chromium.org
4 years, 1 month ago (2016-10-31 05:38:57 UTC) #262
commit-bot: I haz the power
Dry run: Try jobs failed on following builders: cast_shell_linux on master.tryserver.chromium.linux (JOB_FAILED, http://build.chromium.org/p/tryserver.chromium.linux/builders/cast_shell_linux/builds/251436) chromeos_daisy_chromium_compile_only_ng on ...
4 years, 1 month ago (2016-10-31 05:38:59 UTC) #263
yosin_UTC9
The CQ bit was checked by yosin@chromium.org to run a CQ dry run
4 years, 1 month ago (2016-10-31 08:43:07 UTC) #264
commit-bot: I haz the power
Dry run: CQ is trying da patch. Follow status at https://chromium-cq-status.appspot.com/v2/patch-status/codereview.chromium.org/1958093002/1670001
4 years, 1 month ago (2016-10-31 08:43:18 UTC) #265
commit-bot: I haz the power
The CQ bit was unchecked by commit-bot@chromium.org
4 years, 1 month ago (2016-10-31 08:46:19 UTC) #266
commit-bot: I haz the power
Dry run: Try jobs failed on following builders: mac_chromium_compile_dbg_ng on master.tryserver.chromium.mac (JOB_FAILED, http://build.chromium.org/p/tryserver.chromium.mac/builders/mac_chromium_compile_dbg_ng/builds/296457)
4 years, 1 month ago (2016-10-31 08:46:22 UTC) #267
yosin_UTC9
The CQ bit was checked by yosin@chromium.org to run a CQ dry run
4 years, 1 month ago (2016-10-31 10:42:30 UTC) #268
commit-bot: I haz the power
Dry run: CQ is trying da patch. Follow status at https://chromium-cq-status.appspot.com/v2/patch-status/codereview.chromium.org/1958093002/1690001
4 years, 1 month ago (2016-10-31 10:42:48 UTC) #269
yosin_UTC9
The CQ bit was checked by yosin@chromium.org to run a CQ dry run
4 years, 1 month ago (2016-10-31 10:48:42 UTC) #270
commit-bot: I haz the power
Dry run: CQ is trying da patch. Follow status at https://chromium-cq-status.appspot.com/v2/patch-status/codereview.chromium.org/1958093002/1730001
4 years, 1 month ago (2016-10-31 10:49:03 UTC) #271
commit-bot: I haz the power
The CQ bit was unchecked by commit-bot@chromium.org
4 years, 1 month ago (2016-10-31 11:03:18 UTC) #272
commit-bot: I haz the power
Dry run: Try jobs failed on following builders: linux_chromium_chromeos_ozone_rel_ng on master.tryserver.chromium.linux (JOB_FAILED, http://build.chromium.org/p/tryserver.chromium.linux/builders/linux_chromium_chromeos_ozone_rel_ng/builds/263089)
4 years, 1 month ago (2016-10-31 11:03:20 UTC) #273
yosin_UTC9
The CQ bit was checked by yosin@chromium.org to run a CQ dry run
4 years, 1 month ago (2016-11-01 05:40:35 UTC) #274
commit-bot: I haz the power
Dry run: CQ is trying da patch. Follow status at https://chromium-cq-status.appspot.com/v2/patch-status/codereview.chromium.org/1958093002/1750001
4 years, 1 month ago (2016-11-01 05:40:50 UTC) #275
commit-bot: I haz the power
The CQ bit was unchecked by commit-bot@chromium.org
4 years, 1 month ago (2016-11-01 06:21:03 UTC) #276
commit-bot: I haz the power
Dry run: Try jobs failed on following builders: linux_android_rel_ng on master.tryserver.chromium.android (JOB_FAILED, https://build.chromium.org/p/tryserver.chromium.android/builders/linux_android_rel_ng/builds/171760)
4 years, 1 month ago (2016-11-01 06:21:06 UTC) #277
yosin_UTC9
The CQ bit was checked by yosin@chromium.org to run a CQ dry run
4 years, 1 month ago (2016-11-01 10:15:23 UTC) #278
commit-bot: I haz the power
Dry run: CQ is trying da patch. Follow status at https://chromium-cq-status.appspot.com/v2/patch-status/codereview.chromium.org/1958093002/1770001
4 years, 1 month ago (2016-11-01 10:15:42 UTC) #279
commit-bot: I haz the power
The CQ bit was unchecked by commit-bot@chromium.org
4 years, 1 month ago (2016-11-01 10:46:46 UTC) #280
commit-bot: I haz the power
Dry run: Try jobs failed on following builders: linux_layout_tests_slimming_paint_v2 on master.tryserver.chromium.linux (JOB_FAILED, http://build.chromium.org/p/tryserver.chromium.linux/builders/linux_layout_tests_slimming_paint_v2/builds/1170)
4 years, 1 month ago (2016-11-01 10:46:48 UTC) #281
yosin_UTC9
The CQ bit was checked by yosin@chromium.org to run a CQ dry run
4 years, 1 month ago (2016-11-02 08:25:58 UTC) #282
commit-bot: I haz the power
Dry run: CQ is trying da patch. Follow status at https://chromium-cq-status.appspot.com/v2/patch-status/codereview.chromium.org/1958093002/1790001
4 years, 1 month ago (2016-11-02 08:26:16 UTC) #283
commit-bot: I haz the power
The CQ bit was unchecked by commit-bot@chromium.org
4 years, 1 month ago (2016-11-02 08:29:26 UTC) #284
commit-bot: I haz the power
Dry run: Try jobs failed on following builders: chromium_presubmit on master.tryserver.chromium.linux (JOB_FAILED, http://build.chromium.org/p/tryserver.chromium.linux/builders/chromium_presubmit/builds/294800) linux_chromium_chromeos_rel_ng on ...
4 years, 1 month ago (2016-11-02 08:29:31 UTC) #285
yosin_UTC9
The CQ bit was checked by yosin@chromium.org to run a CQ dry run
4 years, 1 month ago (2016-11-02 09:26:47 UTC) #286
commit-bot: I haz the power
Dry run: CQ is trying da patch. Follow status at https://chromium-cq-status.appspot.com/v2/patch-status/codereview.chromium.org/1958093002/1810001
4 years, 1 month ago (2016-11-02 09:27:06 UTC) #287
yosin_UTC9
The CQ bit was checked by yosin@chromium.org to run a CQ dry run
4 years, 1 month ago (2016-11-02 09:33:36 UTC) #288
commit-bot: I haz the power
Dry run: CQ is trying da patch. Follow status at https://chromium-cq-status.appspot.com/v2/patch-status/codereview.chromium.org/1958093002/1830001
4 years, 1 month ago (2016-11-02 09:33:49 UTC) #289
commit-bot: I haz the power
The CQ bit was unchecked by commit-bot@chromium.org
4 years, 1 month ago (2016-11-02 10:12:56 UTC) #290
commit-bot: I haz the power
Dry run: Try jobs failed on following builders: linux_chromium_rel_ng on master.tryserver.chromium.linux (JOB_FAILED, http://build.chromium.org/p/tryserver.chromium.linux/builders/linux_chromium_rel_ng/builds/329199)
4 years, 1 month ago (2016-11-02 10:12:59 UTC) #291
yosin_UTC9
Description was changed from ========== Lazy Visible Seleciton Validation 1. crrev.com/1983003002: Introduce SelectionModifier class 2. ...
4 years, 1 month ago (2016-11-07 08:52:40 UTC) #292
yosin_UTC9
The CQ bit was checked by yosin@chromium.org to run a CQ dry run
4 years, 1 month ago (2016-11-07 08:56:36 UTC) #293
commit-bot: I haz the power
Dry run: CQ is trying da patch. Follow status at https://chromium-cq-status.appspot.com/v2/patch-status/codereview.chromium.org/1958093002/1850001
4 years, 1 month ago (2016-11-07 08:56:52 UTC) #294
commit-bot: I haz the power
The CQ bit was unchecked by commit-bot@chromium.org
4 years, 1 month ago (2016-11-07 09:39:36 UTC) #295
commit-bot: I haz the power
Dry run: Try jobs failed on following builders: linux_chromium_chromeos_rel_ng on master.tryserver.chromium.linux (JOB_FAILED, http://build.chromium.org/p/tryserver.chromium.linux/builders/linux_chromium_chromeos_rel_ng/builds/309994)
4 years, 1 month ago (2016-11-07 09:39:38 UTC) #296
yosin_UTC9
The CQ bit was checked by yosin@chromium.org to run a CQ dry run
4 years, 1 month ago (2016-11-07 09:58:34 UTC) #297
commit-bot: I haz the power
Dry run: CQ is trying da patch. Follow status at https://chromium-cq-status.appspot.com/v2/patch-status/codereview.chromium.org/1958093002/1870001
4 years, 1 month ago (2016-11-07 09:58:44 UTC) #298
commit-bot: I haz the power
The CQ bit was unchecked by commit-bot@chromium.org
4 years, 1 month ago (2016-11-07 10:32:19 UTC) #299
commit-bot: I haz the power
Dry run: Try jobs failed on following builders: linux_layout_tests_slimming_paint_v2 on master.tryserver.chromium.linux (JOB_FAILED, http://build.chromium.org/p/tryserver.chromium.linux/builders/linux_layout_tests_slimming_paint_v2/builds/1253)
4 years, 1 month ago (2016-11-07 10:32:21 UTC) #300
yosin_UTC9
The CQ bit was checked by yosin@chromium.org to run a CQ dry run
4 years, 1 month ago (2016-11-08 10:32:23 UTC) #301
commit-bot: I haz the power
Dry run: CQ is trying da patch. Follow status at https://chromium-cq-status.appspot.com/v2/patch-status/codereview.chromium.org/1958093002/1910001
4 years, 1 month ago (2016-11-08 10:32:49 UTC) #302
commit-bot: I haz the power
The CQ bit was unchecked by commit-bot@chromium.org
4 years, 1 month ago (2016-11-08 10:35:50 UTC) #303
commit-bot: I haz the power
Dry run: Try jobs failed on following builders: linux_chromium_chromeos_compile_dbg_ng on master.tryserver.chromium.linux (JOB_FAILED, http://build.chromium.org/p/tryserver.chromium.linux/builders/linux_chromium_chromeos_compile_dbg_ng/builds/294227) linux_chromium_chromeos_ozone_rel_ng on ...
4 years, 1 month ago (2016-11-08 10:35:53 UTC) #304
yosin_UTC9
The CQ bit was checked by yosin@chromium.org to run a CQ dry run
4 years, 1 month ago (2016-11-09 03:12:03 UTC) #305
commit-bot: I haz the power
Dry run: CQ is trying da patch. Follow status at https://chromium-cq-status.appspot.com/v2/patch-status/codereview.chromium.org/1958093002/1930001
4 years, 1 month ago (2016-11-09 03:12:32 UTC) #306
yosin_UTC9
Patchset #97 (id:1910001) has been deleted
4 years, 1 month ago (2016-11-09 03:12:33 UTC) #307
commit-bot: I haz the power
The CQ bit was unchecked by commit-bot@chromium.org
4 years, 1 month ago (2016-11-09 04:02:25 UTC) #308
commit-bot: I haz the power
Dry run: Try jobs failed on following builders: linux_chromium_chromeos_rel_ng on master.tryserver.chromium.linux (JOB_FAILED, http://build.chromium.org/p/tryserver.chromium.linux/builders/linux_chromium_chromeos_rel_ng/builds/311560)
4 years, 1 month ago (2016-11-09 04:02:27 UTC) #309
yosin_UTC9
Description was changed from ========== Lazy Visible Seleciton Validation 1. crrev.com/1983003002: Introduce SelectionModifier class 2. ...
4 years, 1 month ago (2016-11-09 05:45:08 UTC) #310
yosin_UTC9
Description was changed from ========== Lazy Visible Seleciton Validation 1. crrev.com/1983003002: Introduce SelectionModifier class 2. ...
4 years, 1 month ago (2016-11-09 07:52:13 UTC) #311
yosin_UTC9
Description was changed from ========== Lazy Visible Seleciton Validation 1. crrev.com/1983003002: Introduce SelectionModifier class 2. ...
4 years, 1 month ago (2016-11-10 03:55:32 UTC) #312
yosin_UTC9
Description was changed from ========== Lazy Visible Seleciton Validation 1. crrev.com/1983003002: Introduce SelectionModifier class 2. ...
4 years, 1 month ago (2016-11-10 06:57:37 UTC) #313
yosin_UTC9
The CQ bit was checked by yosin@chromium.org to run a CQ dry run
4 years, 1 month ago (2016-11-10 07:00:26 UTC) #314
commit-bot: I haz the power
Dry run: CQ is trying da patch. Follow status at https://chromium-cq-status.appspot.com/v2/patch-status/codereview.chromium.org/1958093002/1950001
4 years, 1 month ago (2016-11-10 07:00:47 UTC) #315
yosin_UTC9
The CQ bit was checked by yosin@chromium.org to run a CQ dry run
4 years, 1 month ago (2016-11-10 07:29:19 UTC) #316
commit-bot: I haz the power
Dry run: CQ is trying da patch. Follow status at https://chromium-cq-status.appspot.com/v2/patch-status/codereview.chromium.org/1958093002/1970001
4 years, 1 month ago (2016-11-10 07:29:34 UTC) #317
commit-bot: I haz the power
The CQ bit was unchecked by commit-bot@chromium.org
4 years, 1 month ago (2016-11-10 08:13:44 UTC) #318
commit-bot: I haz the power
Dry run: Try jobs failed on following builders: android_n5x_swarming_rel on master.tryserver.chromium.android (JOB_FAILED, https://build.chromium.org/p/tryserver.chromium.android/builders/android_n5x_swarming_rel/builds/65127)
4 years, 1 month ago (2016-11-10 08:13:47 UTC) #319
yosin_UTC9
The CQ bit was checked by yosin@chromium.org to run a CQ dry run
4 years, 1 month ago (2016-11-10 09:27:57 UTC) #320
commit-bot: I haz the power
Dry run: CQ is trying da patch. Follow status at https://chromium-cq-status.appspot.com/v2/patch-status/codereview.chromium.org/1958093002/1990001
4 years, 1 month ago (2016-11-10 09:28:16 UTC) #321
commit-bot: I haz the power
The CQ bit was unchecked by commit-bot@chromium.org
4 years, 1 month ago (2016-11-10 09:46:49 UTC) #322
commit-bot: I haz the power
Dry run: Try jobs failed on following builders: linux_chromium_asan_rel_ng on master.tryserver.chromium.linux (JOB_FAILED, http://build.chromium.org/p/tryserver.chromium.linux/builders/linux_chromium_asan_rel_ng/builds/259889) linux_chromium_rel_ng on ...
4 years, 1 month ago (2016-11-10 09:46:52 UTC) #323
yosin_UTC9
The CQ bit was checked by yosin@chromium.org to run a CQ dry run
4 years, 1 month ago (2016-11-11 07:41:12 UTC) #324
commit-bot: I haz the power
Dry run: CQ is trying da patch. Follow status at https://chromium-cq-status.appspot.com/v2/patch-status/codereview.chromium.org/1958093002/2030001
4 years, 1 month ago (2016-11-11 07:41:32 UTC) #325
commit-bot: I haz the power
The CQ bit was unchecked by commit-bot@chromium.org
4 years, 1 month ago (2016-11-11 08:21:42 UTC) #326
commit-bot: I haz the power
Dry run: Try jobs failed on following builders: android_n5x_swarming_rel on master.tryserver.chromium.android (JOB_FAILED, https://build.chromium.org/p/tryserver.chromium.android/builders/android_n5x_swarming_rel/builds/65913)
4 years, 1 month ago (2016-11-11 08:21:44 UTC) #327
yosin_UTC9
The CQ bit was checked by yosin@chromium.org to run a CQ dry run
4 years, 1 month ago (2016-11-14 06:19:00 UTC) #328
commit-bot: I haz the power
Dry run: CQ is trying da patch. Follow status at https://chromium-cq-status.appspot.com/v2/patch-status/codereview.chromium.org/1958093002/2050001
4 years, 1 month ago (2016-11-14 06:19:13 UTC) #329
commit-bot: I haz the power
The CQ bit was unchecked by commit-bot@chromium.org
4 years, 1 month ago (2016-11-14 06:33:15 UTC) #330
commit-bot: I haz the power
Dry run: Try jobs failed on following builders: cast_shell_linux on master.tryserver.chromium.linux (JOB_FAILED, http://build.chromium.org/p/tryserver.chromium.linux/builders/cast_shell_linux/builds/259645)
4 years, 1 month ago (2016-11-14 06:33:18 UTC) #331
yosin_UTC9
The CQ bit was checked by yosin@chromium.org to run a CQ dry run
4 years, 1 month ago (2016-11-14 10:10:03 UTC) #332
commit-bot: I haz the power
Dry run: CQ is trying da patch. Follow status at https://chromium-cq-status.appspot.com/v2/patch-status/codereview.chromium.org/1958093002/2070001
4 years, 1 month ago (2016-11-14 10:10:18 UTC) #333
commit-bot: I haz the power
The CQ bit was unchecked by commit-bot@chromium.org
4 years, 1 month ago (2016-11-14 11:02:02 UTC) #334
commit-bot: I haz the power
Dry run: Try jobs failed on following builders: linux_android_rel_ng on master.tryserver.chromium.android (JOB_FAILED, https://build.chromium.org/p/tryserver.chromium.android/builders/linux_android_rel_ng/builds/179690)
4 years, 1 month ago (2016-11-14 11:02:04 UTC) #335
yosin_UTC9
The CQ bit was checked by yosin@chromium.org to run a CQ dry run
4 years, 1 month ago (2016-11-15 09:52:15 UTC) #336
commit-bot: I haz the power
Dry run: CQ is trying da patch. Follow status at https://chromium-cq-status.appspot.com/v2/patch-status/codereview.chromium.org/1958093002/2090001
4 years, 1 month ago (2016-11-15 09:52:34 UTC) #337
commit-bot: I haz the power
The CQ bit was unchecked by commit-bot@chromium.org
4 years, 1 month ago (2016-11-15 09:55:19 UTC) #338
commit-bot: I haz the power
Dry run: Try jobs failed on following builders: mac_chromium_compile_dbg_ng on master.tryserver.chromium.mac (JOB_FAILED, http://build.chromium.org/p/tryserver.chromium.mac/builders/mac_chromium_compile_dbg_ng/builds/305896)
4 years, 1 month ago (2016-11-15 09:55:22 UTC) #339
yosin_UTC9
The CQ bit was checked by yosin@chromium.org to run a CQ dry run
4 years, 1 month ago (2016-11-15 10:20:41 UTC) #340
yosin_UTC9
Patchset #105 (id:2090001) has been deleted
4 years, 1 month ago (2016-11-15 10:20:50 UTC) #341
commit-bot: I haz the power
Dry run: CQ is trying da patch. Follow status at https://chromium-cq-status.appspot.com/v2/patch-status/codereview.chromium.org/1958093002/2110001
4 years, 1 month ago (2016-11-15 10:20:55 UTC) #342
commit-bot: I haz the power
The CQ bit was unchecked by commit-bot@chromium.org
4 years, 1 month ago (2016-11-15 10:34:45 UTC) #343
commit-bot: I haz the power
Dry run: Try jobs failed on following builders: blimp_linux_dbg on master.tryserver.chromium.linux (JOB_FAILED, http://build.chromium.org/p/tryserver.chromium.linux/builders/blimp_linux_dbg/builds/32659) cast_shell_linux on ...
4 years, 1 month ago (2016-11-15 10:34:47 UTC) #344
yosin_UTC9
The CQ bit was checked by yosin@chromium.org to run a CQ dry run
4 years, 1 month ago (2016-11-16 06:18:48 UTC) #345
commit-bot: I haz the power
Dry run: CQ is trying da patch. Follow status at https://chromium-cq-status.appspot.com/v2/patch-status/codereview.chromium.org/1958093002/2130001
4 years, 1 month ago (2016-11-16 06:19:12 UTC) #346
commit-bot: I haz the power
The CQ bit was unchecked by commit-bot@chromium.org
4 years, 1 month ago (2016-11-16 06:23:39 UTC) #347
commit-bot: I haz the power
Dry run: Try jobs failed on following builders: mac_chromium_compile_dbg_ng on master.tryserver.chromium.mac (JOB_FAILED, http://build.chromium.org/p/tryserver.chromium.mac/builders/mac_chromium_compile_dbg_ng/builds/306734) mac_chromium_rel_ng on ...
4 years, 1 month ago (2016-11-16 06:23:41 UTC) #348
yosin_UTC9
Patchset #106 (id:2130001) has been deleted
4 years, 1 month ago (2016-11-16 06:38:04 UTC) #349
yosin_UTC9
The CQ bit was checked by yosin@chromium.org to run a CQ dry run
4 years, 1 month ago (2016-11-16 07:27:18 UTC) #350
commit-bot: I haz the power
Dry run: CQ is trying da patch. Follow status at https://chromium-cq-status.appspot.com/v2/patch-status/codereview.chromium.org/1958093002/2150001
4 years, 1 month ago (2016-11-16 07:27:42 UTC) #351
commit-bot: I haz the power
The CQ bit was unchecked by commit-bot@chromium.org
4 years, 1 month ago (2016-11-16 07:30:43 UTC) #352
commit-bot: I haz the power
Dry run: Try jobs failed on following builders: blimp_linux_dbg on master.tryserver.chromium.linux (JOB_FAILED, http://build.chromium.org/p/tryserver.chromium.linux/builders/blimp_linux_dbg/builds/33462)
4 years, 1 month ago (2016-11-16 07:30:45 UTC) #353
yosin_UTC9
Patchset #106 (id:2150001) has been deleted
4 years, 1 month ago (2016-11-16 08:17:30 UTC) #354
yosin_UTC9
The CQ bit was checked by yosin@chromium.org to run a CQ dry run
4 years, 1 month ago (2016-11-16 10:09:00 UTC) #355
commit-bot: I haz the power
Dry run: CQ is trying da patch. Follow status at https://chromium-cq-status.appspot.com/v2/patch-status/codereview.chromium.org/1958093002/2170001
4 years, 1 month ago (2016-11-16 10:09:21 UTC) #356
commit-bot: I haz the power
The CQ bit was unchecked by commit-bot@chromium.org
4 years, 1 month ago (2016-11-16 11:16:23 UTC) #357
commit-bot: I haz the power
Dry run: Try jobs failed on following builders: mac_chromium_rel_ng on master.tryserver.chromium.mac (JOB_FAILED, http://build.chromium.org/p/tryserver.chromium.mac/builders/mac_chromium_rel_ng/builds/336439)
4 years, 1 month ago (2016-11-16 11:16:25 UTC) #358
yosin_UTC9
The CQ bit was checked by yosin@chromium.org to run a CQ dry run
4 years, 1 month ago (2016-11-17 03:44:19 UTC) #359
commit-bot: I haz the power
Dry run: CQ is trying da patch. Follow status at https://chromium-cq-status.appspot.com/v2/patch-status/codereview.chromium.org/1958093002/2190001
4 years, 1 month ago (2016-11-17 03:45:31 UTC) #360
commit-bot: I haz the power
The CQ bit was unchecked by commit-bot@chromium.org
4 years, 1 month ago (2016-11-17 04:51:33 UTC) #361
commit-bot: I haz the power
Dry run: Try jobs failed on following builders: mac_chromium_rel_ng on master.tryserver.chromium.mac (JOB_FAILED, http://build.chromium.org/p/tryserver.chromium.mac/builders/mac_chromium_rel_ng/builds/337366)
4 years, 1 month ago (2016-11-17 04:51:36 UTC) #362
yosin_UTC9
Description was changed from ========== On-demand visible selection canonicalizataion After this patch, we will do ...
4 years, 1 month ago (2016-11-17 08:06:15 UTC) #363
yosin_UTC9
Description was changed from ========== On-demand visible selection canonicalizataion After this patch, we will do ...
4 years, 1 month ago (2016-11-18 06:47:20 UTC) #364
yosin_UTC9
Description was changed from ========== On-demand visible selection canonicalizataion After this patch, we will do ...
4 years, 1 month ago (2016-11-18 10:43:31 UTC) #365
yosin_UTC9
The CQ bit was checked by yosin@chromium.org to run a CQ dry run
4 years, 1 month ago (2016-11-18 10:43:51 UTC) #366
commit-bot: I haz the power
Dry run: CQ is trying da patch. Follow status at https://chromium-cq-status.appspot.com/v2/patch-status/codereview.chromium.org/1958093002/2210001
4 years, 1 month ago (2016-11-18 10:44:18 UTC) #367
commit-bot: I haz the power
The CQ bit was unchecked by commit-bot@chromium.org
4 years, 1 month ago (2016-11-18 10:48:05 UTC) #368
commit-bot: I haz the power
Dry run: Try jobs failed on following builders: chromium_presubmit on master.tryserver.chromium.linux (JOB_FAILED, http://build.chromium.org/p/tryserver.chromium.linux/builders/chromium_presubmit/builds/308092) linux_chromium_clobber_rel_ng on ...
4 years, 1 month ago (2016-11-18 10:48:07 UTC) #369
yosin_UTC9
The CQ bit was checked by yosin@chromium.org to run a CQ dry run
4 years ago (2016-11-21 04:19:37 UTC) #370
commit-bot: I haz the power
Dry run: CQ is trying da patch. Follow status at https://chromium-cq-status.appspot.com/v2/patch-status/codereview.chromium.org/1958093002/2230001
4 years ago (2016-11-21 04:19:57 UTC) #371
commit-bot: I haz the power
The CQ bit was unchecked by commit-bot@chromium.org
4 years ago (2016-11-21 04:58:41 UTC) #372
commit-bot: I haz the power
Dry run: Try jobs failed on following builders: linux_android_rel_ng on master.tryserver.chromium.android (JOB_FAILED, https://build.chromium.org/p/tryserver.chromium.android/builders/linux_android_rel_ng/builds/184603)
4 years ago (2016-11-21 04:58:43 UTC) #373
yosin_UTC9
Patchset #108 (id:2210001) has been deleted
4 years ago (2016-11-21 05:34:50 UTC) #374
yosin_UTC9
The CQ bit was checked by yosin@chromium.org to run a CQ dry run
4 years ago (2016-11-24 04:47:51 UTC) #375
commit-bot: I haz the power
Dry run: CQ is trying da patch. Follow status at https://chromium-cq-status.appspot.com/v2/patch-status/codereview.chromium.org/1958093002/2250001
4 years ago (2016-11-24 04:48:24 UTC) #376
yosin_UTC9
Description was changed from ========== On-demand visible selection canonicalizataion After this patch, we will do ...
4 years ago (2016-11-28 08:17:11 UTC) #377
yosin_UTC9
The CQ bit was checked by yosin@chromium.org to run a CQ dry run
4 years ago (2016-12-01 07:24:24 UTC) #378
commit-bot: I haz the power
Dry run: CQ is trying da patch. Follow status at https://chromium-cq-status.appspot.com/v2/patch-status/codereview.chromium.org/1958093002/2290001
4 years ago (2016-12-01 07:24:49 UTC) #379
commit-bot: I haz the power
The CQ bit was unchecked by commit-bot@chromium.org
4 years ago (2016-12-01 08:20:26 UTC) #380
commit-bot: I haz the power
Dry run: Try jobs failed on following builders: linux_chromium_rel_ng on master.tryserver.chromium.linux (JOB_FAILED, http://build.chromium.org/p/tryserver.chromium.linux/builders/linux_chromium_rel_ng/builds/347783)
4 years ago (2016-12-01 08:20:29 UTC) #381
yosin_UTC9
The CQ bit was checked by yosin@chromium.org to run a CQ dry run
4 years ago (2016-12-02 05:54:37 UTC) #382
commit-bot: I haz the power
Dry run: CQ is trying da patch. Follow status at https://chromium-cq-status.appspot.com/v2/patch-status/codereview.chromium.org/1958093002/2290002
4 years ago (2016-12-02 05:55:01 UTC) #383
commit-bot: I haz the power
The CQ bit was unchecked by commit-bot@chromium.org
4 years ago (2016-12-02 06:41:30 UTC) #384
commit-bot: I haz the power
Dry run: Try jobs failed on following builders: linux_chromium_chromeos_rel_ng on master.tryserver.chromium.linux (JOB_FAILED, http://build.chromium.org/p/tryserver.chromium.linux/builders/linux_chromium_chromeos_rel_ng/builds/325917)
4 years ago (2016-12-02 06:41:33 UTC) #385
yosin_UTC9
Description was changed from ========== BUG=139552, 603684, 605499, 606499, 625533, 644648 On-demand visible selection canonicalizataion ...
3 years, 11 months ago (2017-01-05 07:09:42 UTC) #386
yosin_UTC9
The CQ bit was checked by yosin@chromium.org to run a CQ dry run
3 years, 11 months ago (2017-01-05 07:15:11 UTC) #387
commit-bot: I haz the power
Dry run: CQ is trying da patch. Follow status at https://chromium-cq-status.appspot.com/v2/patch-status/codereview.chromium.org/1958093002/2320001
3 years, 11 months ago (2017-01-05 07:15:29 UTC) #388
commit-bot: I haz the power
The CQ bit was unchecked by commit-bot@chromium.org
3 years, 11 months ago (2017-01-05 08:01:03 UTC) #389
commit-bot: I haz the power
Dry run: Try jobs failed on following builders: linux_android_rel_ng on master.tryserver.chromium.android (JOB_FAILED, https://build.chromium.org/p/tryserver.chromium.android/builders/linux_android_rel_ng/builds/207373)
3 years, 11 months ago (2017-01-05 08:01:06 UTC) #390
yosin_UTC9
Description was changed from ========== BUG=139552, 603684, 605499, 606499, 625533, 644648 On-demand visible selection canonicalizataion ...
3 years, 11 months ago (2017-01-05 08:40:29 UTC) #391
yosin_UTC9
The CQ bit was checked by yosin@chromium.org to run a CQ dry run
3 years, 11 months ago (2017-01-06 06:04:54 UTC) #392
commit-bot: I haz the power
Dry run: CQ is trying da patch. Follow status at https://chromium-cq-status.appspot.com/v2/patch-status/codereview.chromium.org/1958093002/2340001
3 years, 11 months ago (2017-01-06 06:05:11 UTC) #393
commit-bot: I haz the power
The CQ bit was unchecked by commit-bot@chromium.org
3 years, 11 months ago (2017-01-06 06:48:26 UTC) #394
commit-bot: I haz the power
Dry run: Try jobs failed on following builders: linux_layout_tests_slimming_paint_v2 on master.tryserver.chromium.linux (JOB_FAILED, http://build.chromium.org/p/tryserver.chromium.linux/builders/linux_layout_tests_slimming_paint_v2/builds/2204)
3 years, 11 months ago (2017-01-06 06:48:28 UTC) #395
yosin_UTC9
Description was changed from ========== BUG=139552, 603684, 605499, 606499, 625533, 644648 On-demand visible selection canonicalizataion ...
3 years, 11 months ago (2017-01-11 06:32:03 UTC) #396
yosin_UTC9
The CQ bit was checked by yosin@chromium.org to run a CQ dry run
3 years, 11 months ago (2017-01-16 08:47:59 UTC) #397
commit-bot: I haz the power
Dry run: CQ is trying da patch. Follow status at https://chromium-cq-status.appspot.com/v2/patch-status/codereview.chromium.org/1958093002/2360001
3 years, 11 months ago (2017-01-16 08:48:14 UTC) #398
commit-bot: I haz the power
The CQ bit was unchecked by commit-bot@chromium.org
3 years, 11 months ago (2017-01-16 08:50:19 UTC) #399
commit-bot: I haz the power
Dry run: Try jobs failed on following builders: ios-device on master.tryserver.chromium.mac (JOB_FAILED, http://build.chromium.org/p/tryserver.chromium.mac/builders/ios-device/builds/136346) ios-device-xcode-clang on ...
3 years, 11 months ago (2017-01-16 08:50:21 UTC) #400
yosin_UTC9
The CQ bit was checked by yosin@chromium.org to run a CQ dry run
3 years, 11 months ago (2017-01-16 11:07:57 UTC) #401
commit-bot: I haz the power
Dry run: CQ is trying da patch. Follow status at https://chromium-cq-status.appspot.com/v2/patch-status/codereview.chromium.org/1958093002/2380001
3 years, 11 months ago (2017-01-16 11:08:10 UTC) #402
commit-bot: I haz the power
The CQ bit was unchecked by commit-bot@chromium.org
3 years, 11 months ago (2017-01-16 11:10:28 UTC) #403
commit-bot: I haz the power
Dry run: Try jobs failed on following builders: ios-device-xcode-clang on master.tryserver.chromium.mac (JOB_FAILED, http://build.chromium.org/p/tryserver.chromium.mac/builders/ios-device-xcode-clang/builds/21686) ios-simulator on ...
3 years, 11 months ago (2017-01-16 11:10:31 UTC) #404
yosin_UTC9
3 years, 11 months ago (2017-01-17 01:29:25 UTC) #405
Description was changed from

==========
BUG=139552, 603684, 605499, 606499, 625533, 644648, 679991

On-demand visible selection canonicalizataion

After this patch, we will do following:
 - Rename FrameSelection::selection() to computeVisibleSelectionDerprecated()
 - Hoist updateStyleAndLayoutIngoringStyleSheet() from
computeVisibleSelectionDerprecated()
 - Interoperabl Selection API; no canonicalization
 - Multiple range selection
 - Move VisiblePosition and VisibleSelection to editing/core/commands

TDOO(yosin) Incorporate below changes into FrameCaret.cpp
- http://ccrrev.com/2565103002: Fix mismatched nullptr check for caret paint
invalidation.
- http://crrev.com/2599613002: [SPInvalidation] Fix caret paint invalidation in
sub frames

== Failed test 2017-01-05T17:39:23

* ApplyStyleCommandTest.RemoveRedundantBlocksWithStarEditableStyle
* DocumentTest.SynchronousMutationNotifierMergeTextNodes
 

* editing/execCommand/indent-paragraphs.html
* editing/input/caret-read-only-after-editable.html
* fast/dom/shadow/selection-in-nested-shadow.html
* virtual/spinvalidation/paint/invalidation/4776765.html
* editing/selection/drag-in-iframe.html
* editing/caret/caret-hidden-when-unfocused.html
*
virtual/spinvalidation/paint/invalidation/caret-contenteditable-content-after.html
* virtual/spinvalidation/paint/invalidation/caret-color.html
* virtual/spinvalidation/paint/invalidation/selection-after-delete.html




== Failed test 2016-11-17T17:06
css3/filters/effect-reference-ordering.html
editing/input/caret-read-only-after-editable.html
fast/dom/shadow/selection-in-nested-shadow.html
* fast/events/drag_and_drop_into_removed_on_focus.html
* fast/replaced/selection-rect-transform.html
* fast/replaced/selection-rect.html
images/element-gcd-while-generating-alt-content.html
paint/invalidation/4776765.html
paint/invalidation/selection-after-delete.html
paint/selection/selection-drag-image-in-iframe.html
svg/foreignObject/viewport-foreignobject-crash.html
transforms/3d/point-mapping/3d-point-mapping-deep.html
virtual/gpu-rasterization/images/element-gcd-while-generating-alt-content.html
CQ_INCLUDE_TRYBOTS=master.tryserver.chromium.linux:linux_layout_tests_slimming_paint_v2
==========

to

==========
This patch continues to http://crrev.com/2637013002
Since, this page is too big.


BUG=139552, 603684, 605499, 606499, 625533, 644648, 679991

On-demand visible selection canonicalizataion

After this patch, we will do following:
 - Rename FrameSelection::selection() to computeVisibleSelectionDerprecated()
 - Hoist updateStyleAndLayoutIngoringStyleSheet() from
computeVisibleSelectionDerprecated()
 - Interoperabl Selection API; no canonicalization
 - Multiple range selection
 - Move VisiblePosition and VisibleSelection to editing/core/commands

TDOO(yosin) Incorporate below changes into FrameCaret.cpp
- http://ccrrev.com/2565103002: Fix mismatched nullptr check for caret paint
invalidation.
- http://crrev.com/2599613002: [SPInvalidation] Fix caret paint invalidation in
sub frames

== Failed test 2017-01-05T17:39:23

* ApplyStyleCommandTest.RemoveRedundantBlocksWithStarEditableStyle
* DocumentTest.SynchronousMutationNotifierMergeTextNodes
 

* editing/execCommand/indent-paragraphs.html
* editing/input/caret-read-only-after-editable.html
* fast/dom/shadow/selection-in-nested-shadow.html
* virtual/spinvalidation/paint/invalidation/4776765.html
* editing/selection/drag-in-iframe.html
* editing/caret/caret-hidden-when-unfocused.html
*
virtual/spinvalidation/paint/invalidation/caret-contenteditable-content-after.html
* virtual/spinvalidation/paint/invalidation/caret-color.html
* virtual/spinvalidation/paint/invalidation/selection-after-delete.html




== Failed test 2016-11-17T17:06
css3/filters/effect-reference-ordering.html
editing/input/caret-read-only-after-editable.html
fast/dom/shadow/selection-in-nested-shadow.html
* fast/events/drag_and_drop_into_removed_on_focus.html
* fast/replaced/selection-rect-transform.html
* fast/replaced/selection-rect.html
images/element-gcd-while-generating-alt-content.html
paint/invalidation/4776765.html
paint/invalidation/selection-after-delete.html
paint/selection/selection-drag-image-in-iframe.html
svg/foreignObject/viewport-foreignobject-crash.html
transforms/3d/point-mapping/3d-point-mapping-deep.html
virtual/gpu-rasterization/images/element-gcd-while-generating-alt-content.html
CQ_INCLUDE_TRYBOTS=master.tryserver.chromium.linux:linux_layout_tests_slimming_paint_v2
==========

Powered by Google App Engine
This is Rietveld 408576698